BDBM29841 N-(Pyridin-2-yl) arylsulfonamide, 1
SMILES CCN(CC)C(=O)Cc1cccc(NS(=O)(=O)c2cccc(Cl)c2C)n1
InChI Key InChIKey=JNWQLOFSMUGRNY-UHFFFAOYSA-N
Data  1 KI
PDB links: 1 PDB ID matches this monomer.
  Tab Delimited (TSV)   2D SDfile   Computed 3D by Vconf -m prep SDfile
Find this compound or compounds like it in BindingDB:
Activity Spreadsheet -- Enzyme Inhibition Constant Data from BindingDB
Found 1 hit for monomerid = 29841
Target11-beta-hydroxysteroid dehydrogenase 1(Homo sapiens (Human))
Pfizer
LigandPNGBDBM29841(N-(Pyridin-2-yl) arylsulfonamide, 1)
Affinity DataKi:  287nM ΔG°:  -8.83kcal/molepH: 8.0 T: 2°C. Assay description: The enzyme assay was performed in a round-bottom 96-well plate. The enzyme was pre-incubated in the assay buffer in the presence of NADPH and inhibit...
In DepthDetails ArticlePubMed