BDBM299352 (2R,4S)-2-Carbamoylmethyl-5-(3′-fluorobiphenyl-4-yl)-4-[(3H-[1,2,3]triazole-4-carbonyl)amino]pentanoic Acid::US9593110, Example 54
SMILES CCOC(=O)[C@@H](CO)C[C@@H](Cc1ccc(cc1)-c1cccc(F)c1)NB(C)O
InChI Key InChIKey=BEQRCZIOYWCDLK-UYAOXDASSA-N
Data  1 KI
  Tab Delimited (TSV)   2D SDfile   Computed 3D by Vconf -m prep SDfile
Find this compound or compounds like it in BindingDB:
Activity Spreadsheet -- Enzyme Inhibition Constant Data from BindingDB
Found 1 hit for monomerid = 299352
TargetNeprilysin(Homo sapiens (Human))
Theravence Biopharma R&D Ip
US Patent
LigandPNGBDBM299352((2R,4S)-2-Carbamoylmethyl-5-(3′-fluorobiphen...)
Affinity DataKi:  2.20nM. Assay description: Recombinant human NEP and recombinant human ACE were obtained commercially (R&D Systems, Minneapolis, Minn., catalog numbers 1182-ZN and 929-ZN, resp...
Ligand InfoPC cidPC sid
In DepthDetails US Patent