BDBM29945 piperidine-1-carboxamide, 21h
SMILES [H][C@]1(CCCN(C1)C(=O)N[C@H](CNC)CC1CCCCC1)[C@@](O)(CCCCOC)c1cccc(C)c1
InChI Key InChIKey=KLQZJOZYDBPUFR-IUAQSZDVSA-N
Data  1 IC50
  Tab Delimited (TSV)   2D SDfile   Computed 3D by Vconf -m prep SDfile
Find this compound or compounds like it in BindingDB:
Activity Spreadsheet -- Enzyme Inhibition Constant Data from BindingDB
Found 1 hit for monomerid = 29945
TargetRenin(Homo sapiens (Human))
Vitae Pharmaceuticals
LigandPNGBDBM29945(piperidine-1-carboxamide, 21h)
Affinity DataIC50:  2.5nMpH: 7.0 T: 2°C. Assay description: The activity of renin inhibitors in vitro was measured using the FRET assay, which was carried out in flat-bottom white opaque microtiter plates. The...
In DepthDetails ArticlePubMed