BDBM299856 3-amino-6-(1-{2- [(1- cyanocyclopropyl) methoxy]-6-[(3- oxopiperazin-1- yl)carbonyl] pyrimidin-4-yl} piperidin- 4-yl)pyridine-2- carboxamide::US9593097, Example 226
SMILES NC(=O)c1nc(ccc1N)C1CCN(CC1)c1cc(nc(OCC2(CC2)C#N)n1)C(=O)N1CCNC(=O)C1
InChI Key InChIKey=FYMCDMZQWPHLHU-UHFFFAOYSA-N
Data  1 KI
  Tab Delimited (TSV)   2D SDfile   Computed 3D by Vconf -m prep SDfile
Find this compound or compounds like it in BindingDB:
Activity Spreadsheet -- Enzyme Inhibition Constant Data from BindingDB
Found 1 hit for monomerid = 299856
TargetTyrosine-protein kinase receptor UFO(Homo sapiens (Human))
Pfizer
US Patent
LigandPNGBDBM299856(3-amino-6-(1-{2- [(1- cyanocyclopropyl) methoxy]-6...)
Affinity DataKi:  52.7nM. Assay description: AXL enzyme inhibition (% inhibition, Kiapp and Ki values) by small molecule inhibitors was evaluated using a fluorescence-based microfluidic mobility...
Ligand InfoPC cidPC sid
In DepthDetails US Patent