BDBM300099 4-{[(1S,2R)-2- cyanocyclopropyl] methoxy}-N-[(2R)- 3-hydroxy-3- methylbutan-2-yl]- 6-[4-(4-methoxy- 1H-pyrrolo[2,3- b]pyridin-3- yl)piperidin-1-yl]- 1,3,5-triazine-2- carboxamide::US9593097, Example 480
SMILES COc1ccnc2[nH]cc(C3CCN(CC3)c3nc(OC[C@H]4C[C@H]4C#N)nc(n3)C(=O)N[C@H](C)C(C)(C)O)c12
InChI Key
Data  1 KI
  Tab Delimited (TSV)   2D SDfile   Computed 3D by Vconf -m prep SDfile
Find this compound or compounds like it in BindingDB:
Activity Spreadsheet -- Enzyme Inhibition Constant Data from BindingDB
Found 1 hit for monomerid = 300099
TargetTyrosine-protein kinase receptor UFO(Homo sapiens (Human))
Pfizer
US Patent
LigandPNGBDBM300099(4-{[(1S,2R)-2- cyanocyclopropyl] methoxy}-N-[(2R)-...)
Affinity DataKi:  0.0320nM. Assay description: AXL enzyme inhibition (% inhibition, Kiapp and Ki values) by small molecule inhibitors was evaluated using a fluorescence-based microfluidic mobility...
Ligand InfoPC cidPC sid
In DepthDetails US Patent