BDBM300335 US9593110, 37-1
SMILES C[C@H](N)C(=O)N[C@H](C[C@@H](Cc1ccc(cc1)-c1cc(Cl)ccc1F)NC(=O)c1cnn[nH]1)C(O)=O
InChI Key InChIKey=BJZRQNQFBAVJPL-JOKNJTHLSA-N
Data  1 KI
  Tab Delimited (TSV)   2D SDfile   Computed 3D by Vconf -m prep SDfile
Find this compound or compounds like it in BindingDB:
Activity Spreadsheet -- Enzyme Inhibition Constant Data from BindingDB
Found 1 hit for monomerid = 300335
TargetNeprilysin(Homo sapiens (Human))
Theravence Biopharma R&D Ip
US Patent
LigandPNGBDBM300335(US9593110, 37-1)
Affinity DataKi: <1nM. Assay description: Recombinant human NEP and recombinant human ACE were obtained commercially (R&D Systems, Minneapolis, Minn., catalog numbers 1182-ZN and 929-ZN, resp...
Ligand InfoKEGGPC cidPC sid
In DepthDetails US Patent