BDBM300612 N-[6-(3-fluorophenyl)pyridin-3- yl]-3-{[2-(morpholin-4- yl)propanoyl]amino}-4- (trifluoromethoxy)benzamide::US10130633, Example 182::US10130633, Example 183
SMILES CC(N1CCOCC1)C(=O)Nc1cc(ccc1OC(F)(F)F)C(=O)Nc1ccc(nc1)-c1cccc(F)c1
InChI Key InChIKey=CPGGPSNHWZNRFF-UHFFFAOYSA-N
Data  4 IC50
  Tab Delimited (TSV)   2D SDfile   Computed 3D by Vconf -m prep SDfile
Find this compound or compounds like it in BindingDB:
Activity Spreadsheet -- Enzyme Inhibition Constant Data from BindingDB
Found 4 hits for monomerid = 300612
TargetProtein Wnt-3a(Homo sapiens (Human))
Bayer Pharma Aktiengesellschaft
US Patent
LigandPNGBDBM300612(N-[6-(3-fluorophenyl)pyridin-3- yl]-3-{[2-(morphol...)
Affinity DataIC50:  288nM. Assay description: In preparation of the assay, the two cell lines were plated 24 hours before at 10000 cells per well of a 384 micro titre plate (MTP) in 30 μL gr...
Ligand InfoPC cidPC sid
In DepthDetails US Patent
TargetProtein Wnt-3a(Homo sapiens (Human))
Bayer Pharma Aktiengesellschaft
US Patent
LigandPNGBDBM300612(N-[6-(3-fluorophenyl)pyridin-3- yl]-3-{[2-(morphol...)
Affinity DataIC50: >5.00E+4nM. Assay description: In preparation of the assay, the two cell lines were plated 24 hours before at 10000 cells per well of a 384 micro titre plate (MTP) in 30 μL gr...
Ligand InfoPC cidPC sid
In DepthDetails US Patent
TargetProtein Wnt-3a(Homo sapiens (Human))
Bayer Pharma Aktiengesellschaft
US Patent
LigandPNGBDBM300612(N-[6-(3-fluorophenyl)pyridin-3- yl]-3-{[2-(morphol...)
Affinity DataIC50:  29nM. Assay description: In preparation of the assay, the two cell lines were plated 24 hours before at 10000 cells per well of a 384 micro titre plate (MTP) in 30 μL gr...
Ligand InfoPC cidPC sid
In DepthDetails US Patent
TargetProtein Wnt-3a(Homo sapiens (Human))
Bayer Pharma Aktiengesellschaft
US Patent
LigandPNGBDBM300612(N-[6-(3-fluorophenyl)pyridin-3- yl]-3-{[2-(morphol...)
Affinity DataIC50:  4.40E+4nM. Assay description: In preparation of the assay, the two cell lines were plated 24 hours before at 10000 cells per well of a 384 micro titre plate (MTP) in 30 μL gr...
Ligand InfoPC cidPC sid
In DepthDetails US Patent