BDBM301043 4-(2-{2,8-diazaspiro[4.5]decan-2-yl}- 5-(4-methylphenyl)pyrimidin-4- yl)benzonitrile::US10131664, Example 36::US10543198, Example 36::US10864202, Example 36
SMILES Cc1ccc(cc1)-c1cnc(nc1-c1ccc(cc1)C#N)N1CCC2(C1)CCNCC2
InChI Key InChIKey=JZCQWXOICXKJBH-UHFFFAOYSA-N
Data  3 IC50
  Tab Delimited (TSV)   2D SDfile   Computed 3D by Vconf -m prep SDfile
Find this compound or compounds like it in BindingDB:
Activity Spreadsheet -- Enzyme Inhibition Constant Data from BindingDB
Found 3 hits for monomerid = 301043
TargetLysine-specific histone demethylase 1A(Homo sapiens (Human))
Celgene Quanticel Research
US Patent
LigandPNGBDBM301043(4-(2-{2,8-diazaspiro[4.5]decan-2-yl}- 5-(4-methylp...)
Affinity DataIC50: <10nM. Assay description: The enzymatic assay of LSD1 activity is based on Time Resolved-Fluorescence Resonance Energy Transfer (TR-FRET) detection. The inhibitory properties ...
Ligand InfoPC cidPC sid
In DepthDetails US Patent
TargetLysine-specific histone demethylase 1A(Homo sapiens (Human))
Celgene Quanticel Research
US Patent
LigandPNGBDBM301043(4-(2-{2,8-diazaspiro[4.5]decan-2-yl}- 5-(4-methylp...)
Affinity DataIC50: <100nM. Assay description: The enzymatic assay of LSD1 activity is based on Time Resolved-Fluorescence Resonance Energy Transfer (TR-FRET) detection. The inhibitory properties ...
Ligand InfoPC cidPC sid
In DepthDetails US Patent
TargetLysine-specific histone demethylase 1A(Homo sapiens (Human))
Celgene Quanticel Research
US Patent
LigandPNGBDBM301043(4-(2-{2,8-diazaspiro[4.5]decan-2-yl}- 5-(4-methylp...)
Affinity DataIC50: <100nM. Assay description: This assay determines the ability of a test compound to inhibit LSD1 demethylase activity. E. coli expressed full-length human LSD1 (Accession number...
Ligand InfoPC cidPC sid
In DepthDetails US Patent