BDBM301344 7-(2,6-difluoro-3,5-dimethoxyphenyl)-9,9-dimethyl-2-[2-(4-methylpiperazin-1-yl)ethyl]-3,6,7,9-tetrahydro-8H-pyrrolo[2,3-c]-2,7-naphthyridin-8-one::US10131667, Example 160::US11053246, Example 160::US9611267, Example 160
SMILES COc1cc(OC)c(F)c(N2Cc3cnc4[nH]c(CCN5CCN(C)CC5)cc4c3C(C)(C)C2=O)c1F
InChI Key InChIKey=PPTJSJXRBATRQY-UHFFFAOYSA-N
Data  9 IC50
  Tab Delimited (TSV)   2D SDfile   Computed 3D by Vconf -m prep SDfile
Find this compound or compounds like it in BindingDB:
Activity Spreadsheet -- Enzyme Inhibition Constant Data from BindingDB
Found 9 hits for monomerid = 301344
TargetFibroblast growth factor receptor 1(Homo sapiens (Human))
Incyte
US Patent
LigandPNGBDBM301344(7-(2,6-difluoro-3,5-dimethoxyphenyl)-9,9-dimethyl-...)
Affinity DataIC50: <100nM. Assay description: The inhibitor potency of the exemplified compounds was measured in an enzyme assay that measures peptide phosphorylation using FRET measurements to d...
Ligand InfoPC cidPC sid
In DepthDetails US Patent
TargetFibroblast growth factor receptor 2(Homo sapiens (Human))
Incyte
US Patent
LigandPNGBDBM301344(7-(2,6-difluoro-3,5-dimethoxyphenyl)-9,9-dimethyl-...)
Affinity DataIC50: <100nM
Ligand InfoPC cidPC sid
In DepthDetails US Patent
TargetFibroblast growth factor receptor 3(Homo sapiens (Human))
Incyte
US Patent
LigandPNGBDBM301344(7-(2,6-difluoro-3,5-dimethoxyphenyl)-9,9-dimethyl-...)
Affinity DataIC50: <100nM
Ligand InfoPC cidPC sid
In DepthDetails US Patent
TargetFibroblast growth factor receptor 1(Homo sapiens (Human))
Incyte
US Patent
LigandPNGBDBM301344(7-(2,6-difluoro-3,5-dimethoxyphenyl)-9,9-dimethyl-...)
Affinity DataIC50: <100nM. Assay description: The inhibitor potency of the exemplified compounds was measured in an enzyme assay that measures peptide phosphorylation using FRET measurements to d...
Ligand InfoPC cidPC sid
In DepthDetails US Patent
TargetFibroblast growth factor receptor 3(Homo sapiens (Human))
Incyte
US Patent
LigandPNGBDBM301344(7-(2,6-difluoro-3,5-dimethoxyphenyl)-9,9-dimethyl-...)
Affinity DataIC50: <100nM. Assay description: The inhibitor potency of the exemplified compounds was measured in an enzyme assay that measures peptide phosphorylation using FRET measurements to d...
Ligand InfoPC cidPC sid
In DepthDetails US Patent
TargetFibroblast growth factor receptor 3(Homo sapiens (Human))
Incyte
US Patent
LigandPNGBDBM301344(7-(2,6-difluoro-3,5-dimethoxyphenyl)-9,9-dimethyl-...)
Affinity DataIC50: <100nM. Assay description: The inhibitor potency of the exemplified compounds was measured in an enzyme assay that measures peptide phosphorylation using FRET measurements to d...
Ligand InfoPC cidPC sid
In DepthDetails US Patent
TargetFibroblast growth factor receptor 1(Homo sapiens (Human))
Incyte
US Patent
LigandPNGBDBM301344(7-(2,6-difluoro-3,5-dimethoxyphenyl)-9,9-dimethyl-...)
Affinity DataIC50: <100nM. Assay description: The inhibitor potency of the exemplified compounds was measured in an enzyme assay that measures peptide phosphorylation using FRET measurements to d...
Ligand InfoPC cidPC sid
In DepthDetails US Patent
TargetFibroblast growth factor receptor 2(Homo sapiens (Human))
Incyte
US Patent
LigandPNGBDBM301344(7-(2,6-difluoro-3,5-dimethoxyphenyl)-9,9-dimethyl-...)
Affinity DataIC50: <100nM. Assay description: The inhibitor potency of the exemplified compounds was measured in an enzyme assay that measures peptide phosphorylation using FRET measurements to d...
Ligand InfoPC cidPC sid
In DepthDetails US Patent
TargetFibroblast growth factor receptor 2(Homo sapiens (Human))
Incyte
US Patent
LigandPNGBDBM301344(7-(2,6-difluoro-3,5-dimethoxyphenyl)-9,9-dimethyl-...)
Affinity DataIC50: <100nM. Assay description: The inhibitor potency of the exemplified compounds was measured in an enzyme assay that measures peptide phosphorylation using FRET measurements to d...
Ligand InfoPC cidPC sid
In DepthDetails US Patent