BDBM302195 US9598415, 107
SMILES COc1ncnc(C2CC2)c1-c1ncc2nc(NCc3ccc(nc3)S(C)(=O)=O)c(=O)n(CC(C)C)c2n1
InChI Key InChIKey=OTDXMXKKFYOXLB-UHFFFAOYSA-N
Data  1 IC50
  Tab Delimited (TSV)   2D SDfile   Computed 3D by Vconf -m prep SDfile
Find this compound or compounds like it in BindingDB:
Activity Spreadsheet -- Enzyme Inhibition Constant Data from BindingDB
Found 1 hit for monomerid = 302195
TargetNuclear receptor ROR-gamma(Homo sapiens (Human))
Boehringer Ingelheim International
US Patent
LigandPNGBDBM302195(US9598415, 107)
Affinity DataIC50:  560nM. Assay description: A nuclear receptor transactivation assay is performed to quantitate the ability of test compounds to inhibit RORγ transactivation of a luciferas...
Ligand InfoPC cidPC sid
In DepthDetails US Patent