BDBM302244 US9598415, 156
SMILES CCS(=O)(=O)c1ccc(CNc2nc3cnc(nc3n(CC(C)C)c2=O)-c2c(C)ncnc2C2CC2)cn1
InChI Key InChIKey=NOCQWPXBZDIDHI-UHFFFAOYSA-N
Data  1 IC50
  Tab Delimited (TSV)   2D SDfile   Computed 3D by Vconf -m prep SDfile
Find this compound or compounds like it in BindingDB:
Activity Spreadsheet -- Enzyme Inhibition Constant Data from BindingDB
Found 1 hit for monomerid = 302244
TargetNuclear receptor ROR-gamma(Homo sapiens (Human))
Boehringer Ingelheim International
US Patent
LigandPNGBDBM302244(US9598415, 156)
Affinity DataIC50:  275nM. Assay description: A nuclear receptor transactivation assay is performed to quantitate the ability of test compounds to inhibit RORγ transactivation of a luciferas...
Ligand InfoPC cidPC sid
In DepthDetails US Patent