BDBM302338 US9598415, 250
SMILES CCS(=O)(=O)c1ccc(CNc2nc3cnc(nc3n(C3CCC3)c2=O)-c2c(C)ncnc2C2CC2)cc1
InChI Key InChIKey=SASVNCSFVZUPDE-UHFFFAOYSA-N
Data  1 IC50
  Tab Delimited (TSV)   2D SDfile   Computed 3D by Vconf -m prep SDfile
Find this compound or compounds like it in BindingDB:
Activity Spreadsheet -- Enzyme Inhibition Constant Data from BindingDB
Found 1 hit for monomerid = 302338
TargetNuclear receptor ROR-gamma(Homo sapiens (Human))
Boehringer Ingelheim International
US Patent
LigandPNGBDBM302338(US9598415, 250)
Affinity DataIC50:  190nM. Assay description: A nuclear receptor transactivation assay is performed to quantitate the ability of test compounds to inhibit RORγ transactivation of a luciferas...
Ligand InfoPC cidPC sid
In DepthDetails US Patent