BDBM302342 US9598415, 254
SMILES CC(C)Cn1c2nc(ncc2nc(NCc2ccc(cn2)S(N)(=O)=O)c1=O)-c1c(C)ncnc1C1CC1
InChI Key InChIKey=WDHHRSSIVHQLOB-UHFFFAOYSA-N
Data  1 IC50
  Tab Delimited (TSV)   2D SDfile   Computed 3D by Vconf -m prep SDfile
Find this compound or compounds like it in BindingDB:
Activity Spreadsheet -- Enzyme Inhibition Constant Data from BindingDB
Found 1 hit for monomerid = 302342
TargetNuclear receptor ROR-gamma(Homo sapiens (Human))
Boehringer Ingelheim International
US Patent
LigandPNGBDBM302342(US9598415, 254)
Affinity DataIC50:  455nM. Assay description: A nuclear receptor transactivation assay is performed to quantitate the ability of test compounds to inhibit RORγ transactivation of a luciferas...
Ligand InfoPC cidPC sid
In DepthDetails US Patent