BDBM302534 Isopropyl 4-(3-carbamoyl-2-(3- fluorophenyl)-4,5,6,7- tetrahydropyrazolo[1,5-a]pyrazine- 5-carboxamido) piperidine-1-carboxylate::US9598423, Example 100
SMILES CC(C)OC(=O)N1CCC(CC1)NC(=O)N1CCn2nc(c(C(N)=O)c2C1)-c1cccc(F)c1
InChI Key InChIKey=XDHDKZMPXDXXKX-UHFFFAOYSA-N
Data  2 IC50
  Tab Delimited (TSV)   2D SDfile   Computed 3D by Vconf -m prep SDfile
Find this compound or compounds like it in BindingDB:
Activity Spreadsheet -- Enzyme Inhibition Constant Data from BindingDB
Found 2 hits for monomerid = 302534
TargetCasein kinase I isoform delta(Homo sapiens (Human))
Bristol-Myers Squibb
US Patent
LigandPNGBDBM302534(Isopropyl 4-(3-carbamoyl-2-(3- fluorophenyl)-4,5,6...)
Affinity DataIC50: <10nM. Assay description: The kinase assay was performed in V-bottom 384-well plates. The final assay volume was 30 μl prepared from 15 μl additions of enzyme, subst...
Ligand InfoPC cidPC sid
In DepthDetails US Patent
TargetCasein kinase I isoform epsilon(Homo sapiens (Human))
Bristol-Myers Squibb
US Patent
LigandPNGBDBM302534(Isopropyl 4-(3-carbamoyl-2-(3- fluorophenyl)-4,5,6...)
Affinity DataIC50: <10nM. Assay description: The kinase assay was performed in V-bottom 384-well plates. The final assay volume was 30 μl prepared from 15 μl additions of enzyme, subst...
Ligand InfoPC cidPC sid
In DepthDetails US Patent