BDBM303487 US10138226, Example 2-20-2
SMILES C[C@@H]1C[C@@H](CC(C)(C)C1)n1c(Nc2ccc(OC(F)(F)F)cc2)nc2ccc(cc12)C(=O)N(C)C
InChI Key InChIKey=JLPQKDRSRDLKFZ-APWZRJJASA-N
Data  1 IC50
  Tab Delimited (TSV)   2D SDfile   Computed 3D by Vconf -m prep SDfile
Find this compound or compounds like it in BindingDB:
Activity Spreadsheet -- Enzyme Inhibition Constant Data from BindingDB
Found 1 hit for monomerid = 303487
TargetIsocitrate dehydrogenase [NADP] cytoplasmic [R132H](Homo sapiens (Human))
Bayer Pharma Aktiengesellschaft
US Patent
LigandPNGBDBM303487(US10138226, Example 2-20-2)
Affinity DataIC50:  200nM. Assay description: mIDH1 catalyzes the NADPH-dependent reduction of alpha-ketoglutarate (α-KG) to (2R)-2-hydroxyglutarate (2-HG). NADPH consumption was measured by...
Ligand InfoPC cidPC sid
In DepthDetails US Patent