BDBM30452 Hexahydro-pyrrolo[1,2-b]pyridazin-2-one, 3::hexahydro-pyrrolo[1,2-b]pyridazin-2-one, 4c
SMILES CC(C)(C)CCN1N2CCCC2C(=O)C(C2=Nc3ccc(NS(C)(=O)=O)cc3S(=O)(=O)N2)C1=O
InChI Key InChIKey=DBFDYTLBZXGCSP-UHFFFAOYSA-N
Data  3 IC50  2 EC50
PDB links: 1 PDB ID matches this monomer.
  Tab Delimited (TSV)   2D SDfile   Computed 3D by Vconf -m prep SDfile
Find this compound or compounds like it in BindingDB:
Activity Spreadsheet -- Enzyme Inhibition Constant Data from BindingDB
Found 3 hits for monomerid = 30452
TargetGenome polyprotein(Hepatitis C virus genotype 1b (isolate BK) (HCV))
Anadys Pharmaceuticals
LigandPNGBDBM30452(Hexahydro-pyrrolo[1,2-b]pyridazin-2-one, 3 | hexah...)
Affinity DataIC50: <10nM EC50:  34nMpH: 7.5 T: 2°C. Assay description: Assays were performed in a 96-well streptavidin-coated Flash-Plate using enzyme, RNA substrate, and [alpha-33P]GTP/GTP with inhibitor concentration v...
TargetGenome polyprotein(Hepatitis C virus (HCV genotype 1a, isolate H))
Anadys Pharmaceuticals
LigandPNGBDBM30452(Hexahydro-pyrrolo[1,2-b]pyridazin-2-one, 3 | hexah...)
Affinity DataIC50: <25nM. Assay description: Assays were performed in a 96-well streptavidin-coated Flash-Plate using enzyme (NS5B H77 1a), RNA substrate, and [alpha-33P]GTP/GTP with inhibitor c...
TargetGenome polyprotein(Hepatitis C virus genotype 1b (isolate BK) (HCV))
Anadys Pharmaceuticals
LigandPNGBDBM30452(Hexahydro-pyrrolo[1,2-b]pyridazin-2-one, 3 | hexah...)
Affinity DataIC50: <10nM EC50:  34nMpH: 7.5 T: 2°C. Assay description: Assays were performed in a 96-well streptavidin-coated Flash-Plate using enzyme, RNA substrate, and [alpha-33P]GTP/GTP with inhibitor concentration v...