BDBM30462 benzothiazine-containing analog, 3f
SMILES CC(C)CCn1nc(c(O)c(C2=Nc3ccc(NS(C)(=O)=O)cc3S(=O)(=O)C2)c1=O)-c1ccccc1
InChI Key InChIKey=BZAOQWMZLHROHQ-UHFFFAOYSA-N
Data  1 IC50  1 EC50
  Tab Delimited (TSV)   2D SDfile   Computed 3D by Vconf -m prep SDfile
Find this compound or compounds like it in BindingDB:
Activity Spreadsheet -- Enzyme Inhibition Constant Data from BindingDB
Found 1 hit for monomerid = 30462
TargetGenome polyprotein(Hepatitis C virus genotype 1b (isolate BK) (HCV))
Anadys Pharmaceuticals
LigandPNGBDBM30462(benzothiazine-containing analog, 3f)
Affinity DataIC50:  250nM EC50:  190nMpH: 7.5 T: 2°C. Assay description: Assays were performed in a 96-well streptavidin-coated Flash-Plate using enzyme, RNA substrate, and [alpha-33P]GTP/GTP with inhibitor concentration v...
In DepthDetails ArticlePubMed