BDBM30464 benzothiazine-containing analog, 3h
SMILES CC(C)CCn1nc(-c2cccs2)c(O)c(C2=Nc3ccc(cc3S(=O)(=O)C2)N(C)S(C)(=O)=O)c1=O
InChI Key InChIKey=FPKCBVSLWAFKOV-UHFFFAOYSA-N
Data  1 IC50
  Tab Delimited (TSV)   2D SDfile   Computed 3D by Vconf -m prep SDfile
Find this compound or compounds like it in BindingDB:
Activity Spreadsheet -- Enzyme Inhibition Constant Data from BindingDB
Found 1 hit for monomerid = 30464
TargetGenome polyprotein(Hepatitis C virus genotype 1b (isolate BK) (HCV))
Anadys Pharmaceuticals
LigandPNGBDBM30464(benzothiazine-containing analog, 3h)
Affinity DataIC50:  1.60E+3nMpH: 7.5 T: 2°C. Assay description: Assays were performed in a 96-well streptavidin-coated Flash-Plate using enzyme, RNA substrate, and [alpha-33P]GTP/GTP with inhibitor concentration v...
In DepthDetails ArticlePubMed