BDBM305277 N-(1-(5-(3-cyano-6-(2- hydroxy-2- methylpropoxy)pyrazolo [1,5-a]pyridin-4-yl)pyridin- 2-yl)piperidin-4- yl)nicotinamide::US10144734, Example 293::US10172845, Example 293::US10441581, Example 293::US10881652, Example 293::US11648243, Example 293
SMILES CC(C)(O)COc1cc(-c2ccc(nc2)N2CCC(CC2)NC(=O)c2cccnc2)c2c(cnn2c1)C#N
InChI Key InChIKey=IBDBIFLTNDFJDI-UHFFFAOYSA-N
Data  10 IC50
  Tab Delimited (TSV)   2D SDfile   Computed 3D by Vconf -m prep SDfile
Find this compound or compounds like it in BindingDB:
Activity Spreadsheet -- Enzyme Inhibition Constant Data from BindingDB
Found 10 hits for monomerid = 305277
TargetProto-oncogene tyrosine-protein kinase receptor Ret(Homo sapiens (Human))
Array Biopharma
US Patent
LigandPNGBDBM305277(N-(1-(5-(3-cyano-6-(2- hydroxy-2- methylpropoxy)py...)
Affinity DataIC50:  106nM. Assay description: Compounds of Formula I were screened for their ability to inhibit wildtype and V804M mutant RET kinase using CisBio's HTRF KinEASE-TK assay techn...
Ligand InfoPC cidPC sid
In DepthDetails US Patent
TargetProto-oncogene tyrosine-protein kinase receptor Ret [V804M](Homo sapiens (Human))
Array Biopharma
US Patent
LigandPNGBDBM305277(N-(1-(5-(3-cyano-6-(2- hydroxy-2- methylpropoxy)py...)
Affinity DataIC50:  905nM. Assay description: Compounds of Formula I were screened for their ability to inhibit wildtype and V804M mutant RET kinase using CisBio's HTRF KinEASE-TK assay techn...
Ligand InfoPC cidPC sid
In DepthDetails US Patent
TargetProto-oncogene tyrosine-protein kinase receptor Ret [658-1114](Homo sapiens (Human))
Array Biopharma
US Patent
LigandPNGBDBM305277(N-(1-(5-(3-cyano-6-(2- hydroxy-2- methylpropoxy)py...)
Affinity DataIC50:  106nM. Assay description: Compounds of Formula I were screened for their ability to inhibit wildtype and V804M mutant RET kinase using CisBio's HTRF® KinEASE-TK assay tech...
Ligand InfoPC cidPC sid
In DepthDetails US Patent
TargetProto-oncogene tyrosine-protein kinase receptor Ret [658-1114,V804M](Homo sapiens (Human))
Array Biopharma
US Patent
LigandPNGBDBM305277(N-(1-(5-(3-cyano-6-(2- hydroxy-2- methylpropoxy)py...)
Affinity DataIC50:  905nM. Assay description: Compounds of Formula I were screened for their ability to inhibit wildtype and V804M mutant RET kinase using CisBio's HTRF® KinEASE-TK assay tech...
Ligand InfoPC cidPC sid
In DepthDetails US Patent
TargetProto-oncogene tyrosine-protein kinase receptor Ret [V804M](Homo sapiens (Human))
Array Biopharma
US Patent
LigandPNGBDBM305277(N-(1-(5-(3-cyano-6-(2- hydroxy-2- methylpropoxy)py...)
Affinity DataIC50:  905nM. Assay description: Compounds of Formula I were screened for their ability to inhibit wildtype and V804M mutant RET kinase using CisBio's HTRF® KinEASE™-TK assay tec...
Ligand InfoPC cidPC sid
In DepthDetails US Patent
TargetProto-oncogene tyrosine-protein kinase receptor Ret [G810R](Homo sapiens (Human))
Array Biopharma
US Patent
LigandPNGBDBM305277(N-(1-(5-(3-cyano-6-(2- hydroxy-2- methylpropoxy)py...)
Affinity DataIC50:  905nM. Assay description: The potency of a compound inhibiting G810R mutant RET kinase was determined using CisBio's HTRF Kinease-TK assay technology. The assays contained...
Ligand InfoPC cidPC sid
In DepthDetails US Patent
TargetProto-oncogene tyrosine-protein kinase receptor Ret(Homo sapiens (Human))
Array Biopharma
US Patent
LigandPNGBDBM305277(N-(1-(5-(3-cyano-6-(2- hydroxy-2- methylpropoxy)py...)
Affinity DataIC50:  106nM. Assay description: Wildtype and V804M mutant: Compounds of Formula I were screened for their ability to inhibit wildtype and V804M mutant RET kinase using CisBio's ...
Ligand InfoPC cidPC sid
In DepthDetails US Patent
TargetProto-oncogene tyrosine-protein kinase receptor Ret [V804M](Homo sapiens (Human))
Array Biopharma
US Patent
LigandPNGBDBM305277(N-(1-(5-(3-cyano-6-(2- hydroxy-2- methylpropoxy)py...)
Affinity DataIC50:  905nM. Assay description: Wildtype and V804M mutant: Compounds of Formula I were screened for their ability to inhibit wildtype and V804M mutant RET kinase using CisBio's ...
Ligand InfoPC cidPC sid
In DepthDetails US Patent
TargetProto-oncogene tyrosine-protein kinase receptor Ret [658-1114,V804M](Homo sapiens (Human))
Array Biopharma
US Patent
LigandPNGBDBM305277(N-(1-(5-(3-cyano-6-(2- hydroxy-2- methylpropoxy)py...)
Affinity DataIC50:  106nM. Assay description: Compounds of Formula I were screened for their ability to inhibit wildtype and V804M mutant RET kinase using CisBio's HTRF® KinEASE™-TK assay tec...
Ligand InfoPC cidPC sid
In DepthDetails US Patent
TargetProto-oncogene tyrosine-protein kinase receptor Ret [658-1114,V804M](Homo sapiens (Human))
Array Biopharma
US Patent
LigandPNGBDBM305277(N-(1-(5-(3-cyano-6-(2- hydroxy-2- methylpropoxy)py...)
Affinity DataIC50:  106nM. Assay description: Compounds of Formula I were screened for their ability to inhibit wildtype and V804M mutant RET kinase using CisBio's HTRF KinEASE-TK assay techn...
Ligand InfoPC cidPC sid
In DepthDetails US Patent