BDBM305326 3-chloro-N-(1-(5-(3- cyano-6- ethoxypyrazolo[1,5- a]pyridin-4-yl)pyridin-2- yl)-4- (hydroxymethyl)piperidin- 4-yl)picolinamide::US10144734, Example 342::US10441581, Example 342::US10881652, Example 342::US11648243, Example 342
SMILES CCOc1cc(-c2ccc(nc2)N2CCC(CO)(CC2)NC(=O)c2ncccc2Cl)c2c(cnn2c1)C#N
InChI Key InChIKey=UKZZESSGVNQPCQ-UHFFFAOYSA-N
Data  12 IC50
  Tab Delimited (TSV)   2D SDfile   Computed 3D by Vconf -m prep SDfile
Find this compound or compounds like it in BindingDB:
Activity Spreadsheet -- Enzyme Inhibition Constant Data from BindingDB
Found 12 hits for monomerid = 305326
TargetProto-oncogene tyrosine-protein kinase receptor Ret(Homo sapiens (Human))
Array Biopharma
US Patent
LigandPNGBDBM305326(3-chloro-N-(1-(5-(3- cyano-6- ethoxypyrazolo[1,5- ...)
Affinity DataIC50:  12.4nM. Assay description: Compounds of Formula I were screened for their ability to inhibit wildtype and V804M mutant RET kinase using CisBio's HTRF KinEASE-TK assay techn...
Ligand InfoPC cidPC sid
In DepthDetails US Patent
TargetProto-oncogene tyrosine-protein kinase receptor Ret [V804M](Homo sapiens (Human))
Array Biopharma
US Patent
LigandPNGBDBM305326(3-chloro-N-(1-(5-(3- cyano-6- ethoxypyrazolo[1,5- ...)
Affinity DataIC50:  32nM. Assay description: Compounds of Formula I were screened for their ability to inhibit wildtype and V804M mutant RET kinase using CisBio's HTRF KinEASE-TK assay techn...
Ligand InfoPC cidPC sid
In DepthDetails US Patent
TargetProto-oncogene tyrosine-protein kinase receptor Ret [G810R](Homo sapiens (Human))
Array Biopharma
US Patent
LigandPNGBDBM305326(3-chloro-N-(1-(5-(3- cyano-6- ethoxypyrazolo[1,5- ...)
Affinity DataIC50:  58nM. Assay description: The potency of a compound inhibiting G81 OR mutant RET kinase was determined using CisBio's HTRF Kinease-TK assay technology. The assays containe...
Ligand InfoPC cidPC sid
In DepthDetails US Patent
TargetProto-oncogene tyrosine-protein kinase receptor Ret [658-1114,V804M](Homo sapiens (Human))
Array Biopharma
US Patent
LigandPNGBDBM305326(3-chloro-N-(1-(5-(3- cyano-6- ethoxypyrazolo[1,5- ...)
Affinity DataIC50:  12.4nM. Assay description: Compounds of Formula I were screened for their ability to inhibit wildtype and V804M mutant RET kinase using CisBio's HTRF KinEASE-TK assay techn...
Ligand InfoPC cidPC sid
In DepthDetails US Patent
TargetProto-oncogene tyrosine-protein kinase receptor Ret [G810R](Homo sapiens (Human))
Array Biopharma
US Patent
LigandPNGBDBM305326(3-chloro-N-(1-(5-(3- cyano-6- ethoxypyrazolo[1,5- ...)
Affinity DataIC50:  32nM. Assay description: The potency of a compound inhibiting G810R mutant RET kinase was determined using CisBio's HTRF Kinease-TK assay technology. The assays contained...
Ligand InfoPC cidPC sid
In DepthDetails US Patent
TargetProto-oncogene tyrosine-protein kinase receptor Ret [G810R](Homo sapiens (Human))
Array Biopharma
US Patent
LigandPNGBDBM305326(3-chloro-N-(1-(5-(3- cyano-6- ethoxypyrazolo[1,5- ...)
Affinity DataIC50:  58nM. Assay description: The potency of a compound inhibiting G810R mutant RET kinase was determined using CisBio's HTRF Kinease-TK assay technology. The assays contained...
Ligand InfoPC cidPC sid
In DepthDetails US Patent
TargetProto-oncogene tyrosine-protein kinase receptor Ret(Homo sapiens (Human))
Array Biopharma
US Patent
LigandPNGBDBM305326(3-chloro-N-(1-(5-(3- cyano-6- ethoxypyrazolo[1,5- ...)
Affinity DataIC50:  12.4nM. Assay description: Wildtype and V804M mutant: Compounds of Formula I were screened for their ability to inhibit wildtype and V804M mutant RET kinase using CisBio's ...
Ligand InfoPC cidPC sid
In DepthDetails US Patent
TargetProto-oncogene tyrosine-protein kinase receptor Ret [V804M](Homo sapiens (Human))
Array Biopharma
US Patent
LigandPNGBDBM305326(3-chloro-N-(1-(5-(3- cyano-6- ethoxypyrazolo[1,5- ...)
Affinity DataIC50:  32nM. Assay description: Wildtype and V804M mutant: Compounds of Formula I were screened for their ability to inhibit wildtype and V804M mutant RET kinase using CisBio's ...
Ligand InfoPC cidPC sid
In DepthDetails US Patent
TargetProto-oncogene tyrosine-protein kinase receptor Ret [G810R](Homo sapiens (Human))
Array Biopharma
US Patent
LigandPNGBDBM305326(3-chloro-N-(1-(5-(3- cyano-6- ethoxypyrazolo[1,5- ...)
Affinity DataIC50:  58nM. Assay description: The potency of a compound inhibiting G81 OR mutant RET kinase was determined using CisBio's HTRF Kinease-TK assay technology. The assays containe...
Ligand InfoPC cidPC sid
In DepthDetails US Patent
TargetProto-oncogene tyrosine-protein kinase receptor Ret [658-1114,V804M](Homo sapiens (Human))
Array Biopharma
US Patent
LigandPNGBDBM305326(3-chloro-N-(1-(5-(3- cyano-6- ethoxypyrazolo[1,5- ...)
Affinity DataIC50:  12.4nM. Assay description: Compounds of Formula I were screened for their ability to inhibit wildtype and V804M mutant RET kinase using CisBio's HTRF® KinEASE™-TK assay tec...
Ligand InfoPC cidPC sid
In DepthDetails US Patent
TargetProto-oncogene tyrosine-protein kinase receptor Ret [V804M](Homo sapiens (Human))
Array Biopharma
US Patent
LigandPNGBDBM305326(3-chloro-N-(1-(5-(3- cyano-6- ethoxypyrazolo[1,5- ...)
Affinity DataIC50:  32nM. Assay description: Compounds of Formula I were screened for their ability to inhibit wildtype and V804M mutant RET kinase using CisBio's HTRF® KinEASE™-TK assay tec...
Ligand InfoPC cidPC sid
In DepthDetails US Patent
TargetProto-oncogene tyrosine-protein kinase receptor Ret [V804M](Homo sapiens (Human))
Array Biopharma
US Patent
LigandPNGBDBM305326(3-chloro-N-(1-(5-(3- cyano-6- ethoxypyrazolo[1,5- ...)
Affinity DataIC50:  58nM. Assay description: The potency of a compound inhibiting G810R mutant RET kinase was determined using CisBio's HTRF Kinease-TK assay technology. The assays contained...
Ligand InfoPC cidPC sid
In DepthDetails US Patent