BDBM305414 1-((3-chloro-4-(6-(4-((6- methoxypyridin-3- yl)oxy)piperidin-1- yl)pyridin-3- yl)pyrazolo[1,5-a]pyridin- 6-yl)oxy)-2-methylpropan- 2-ol::US10144734, Example 431::US10172845, Example 431::US10441581, Example 431::US10881652, Example 431
SMILES COc1ccc(OC2CCN(CC2)c2ccc(cn2)-c2cc(OCC(C)(C)O)cn3ncc(Cl)c23)cn1
InChI Key InChIKey=UWAYGYZCCBUUCU-UHFFFAOYSA-N
Data  12 IC50
  Tab Delimited (TSV)   2D SDfile   Computed 3D by Vconf -m prep SDfile
Find this compound or compounds like it in BindingDB:
Activity Spreadsheet -- Enzyme Inhibition Constant Data from BindingDB
Found 12 hits for monomerid = 305414
TargetProto-oncogene tyrosine-protein kinase receptor Ret(Homo sapiens (Human))
Array Biopharma
US Patent
LigandPNGBDBM305414(1-((3-chloro-4-(6-(4-((6- methoxypyridin-3- yl)oxy...)
Affinity DataIC50:  38.2nM. Assay description: Compounds of Formula I were screened for their ability to inhibit wildtype and V804M mutant RET kinase using CisBio's HTRF KinEASE-TK assay techn...
Ligand InfoPC cidPC sid
In DepthDetails US Patent
TargetProto-oncogene tyrosine-protein kinase receptor Ret [V804M](Homo sapiens (Human))
Array Biopharma
US Patent
LigandPNGBDBM305414(1-((3-chloro-4-(6-(4-((6- methoxypyridin-3- yl)oxy...)
Affinity DataIC50:  102nM. Assay description: Compounds of Formula I were screened for their ability to inhibit wildtype and V804M mutant RET kinase using CisBio's HTRF KinEASE-TK assay techn...
Ligand InfoPC cidPC sid
In DepthDetails US Patent
TargetProto-oncogene tyrosine-protein kinase receptor Ret [G810R](Homo sapiens (Human))
Array Biopharma
US Patent
LigandPNGBDBM305414(1-((3-chloro-4-(6-(4-((6- methoxypyridin-3- yl)oxy...)
Affinity DataIC50:  854nM. Assay description: The potency of a compound inhibiting G81 OR mutant RET kinase was determined using CisBio's HTRF Kinease-TK assay technology. The assays containe...
Ligand InfoPC cidPC sid
In DepthDetails US Patent
TargetProto-oncogene tyrosine-protein kinase receptor Ret [658-1114](Homo sapiens (Human))
Array Biopharma
US Patent
LigandPNGBDBM305414(1-((3-chloro-4-(6-(4-((6- methoxypyridin-3- yl)oxy...)
Affinity DataIC50:  38.2nM. Assay description: Compounds of Formula I were screened for their ability to inhibit wildtype and V804M mutant RET kinase using CisBio's HTRF® KinEASE-TK assay tech...
Ligand InfoPC cidPC sid
In DepthDetails US Patent
TargetProto-oncogene tyrosine-protein kinase receptor Ret [658-1114,V804M](Homo sapiens (Human))
Array Biopharma
US Patent
LigandPNGBDBM305414(1-((3-chloro-4-(6-(4-((6- methoxypyridin-3- yl)oxy...)
Affinity DataIC50:  102nM. Assay description: Compounds of Formula I were screened for their ability to inhibit wildtype and V804M mutant RET kinase using CisBio's HTRF® KinEASE-TK assay tech...
Ligand InfoPC cidPC sid
In DepthDetails US Patent
TargetProto-oncogene tyrosine-protein kinase receptor Ret [G810R](Homo sapiens (Human))
Array Biopharma
US Patent
LigandPNGBDBM305414(1-((3-chloro-4-(6-(4-((6- methoxypyridin-3- yl)oxy...)
Affinity DataIC50:  854nM. Assay description: The potency of a compound inhibiting G81 OR mutant RET kinase was determined using CisBio's HTRF Kinease-TK assay technology. The assays containe...
Ligand InfoPC cidPC sid
In DepthDetails US Patent
TargetProto-oncogene tyrosine-protein kinase receptor Ret [658-1114,V804M](Homo sapiens (Human))
Array Biopharma
US Patent
LigandPNGBDBM305414(1-((3-chloro-4-(6-(4-((6- methoxypyridin-3- yl)oxy...)
Affinity DataIC50:  38.2nM. Assay description: Compounds of Formula I were screened for their ability to inhibit wildtype and V804M mutant RET kinase using CisBio's HTRF KinEASE-TK assay techn...
Ligand InfoPC cidPC sid
In DepthDetails US Patent
TargetProto-oncogene tyrosine-protein kinase receptor Ret [G810R](Homo sapiens (Human))
Array Biopharma
US Patent
LigandPNGBDBM305414(1-((3-chloro-4-(6-(4-((6- methoxypyridin-3- yl)oxy...)
Affinity DataIC50:  102nM. Assay description: The potency of a compound inhibiting G810R mutant RET kinase was determined using CisBio's HTRF Kinease-TK assay technology. The assays contained...
Ligand InfoPC cidPC sid
In DepthDetails US Patent
TargetProto-oncogene tyrosine-protein kinase receptor Ret [V804M](Homo sapiens (Human))
Array Biopharma
US Patent
LigandPNGBDBM305414(1-((3-chloro-4-(6-(4-((6- methoxypyridin-3- yl)oxy...)
Affinity DataIC50:  854nM. Assay description: The potency of a compound inhibiting G810R mutant RET kinase was determined using CisBio's HTRF Kinease-TK assay technology. The assays contained...
Ligand InfoPC cidPC sid
In DepthDetails US Patent
TargetProto-oncogene tyrosine-protein kinase receptor Ret(Homo sapiens (Human))
Array Biopharma
US Patent
LigandPNGBDBM305414(1-((3-chloro-4-(6-(4-((6- methoxypyridin-3- yl)oxy...)
Affinity DataIC50:  38.2nM. Assay description: Wildtype and V804M mutant: Compounds of Formula I were screened for their ability to inhibit wildtype and V804M mutant RET kinase using CisBio's ...
Ligand InfoPC cidPC sid
In DepthDetails US Patent
TargetProto-oncogene tyrosine-protein kinase receptor Ret [V804M](Homo sapiens (Human))
Array Biopharma
US Patent
LigandPNGBDBM305414(1-((3-chloro-4-(6-(4-((6- methoxypyridin-3- yl)oxy...)
Affinity DataIC50:  102nM. Assay description: Wildtype and V804M mutant: Compounds of Formula I were screened for their ability to inhibit wildtype and V804M mutant RET kinase using CisBio's ...
Ligand InfoPC cidPC sid
In DepthDetails US Patent
TargetProto-oncogene tyrosine-protein kinase receptor Ret [G810R](Homo sapiens (Human))
Array Biopharma
US Patent
LigandPNGBDBM305414(1-((3-chloro-4-(6-(4-((6- methoxypyridin-3- yl)oxy...)
Affinity DataIC50:  854nM. Assay description: The potency of a compound inhibiting G810R mutant RET kinase was determined using CisBio's HTRF Kinease-TK assay technology. The assays contained...
Ligand InfoPC cidPC sid
In DepthDetails US Patent