BDBM305561 US10144734, Example 578::US10172845, Example 578::US10441581, Example 578::US10881652, Example 578::US11648243, Example 578
SMILES CCOc1cc(-c2ccc(nc2)N2CCC(CN(C)C)(CC2)C(=O)NCC(C)C)c2c(cnn2c1)C#N
InChI Key InChIKey=AVXMOTJDYCKNPU-UHFFFAOYSA-N
Data  15 IC50
  Tab Delimited (TSV)   2D SDfile   Computed 3D by Vconf -m prep SDfile
Find this compound or compounds like it in BindingDB:
Activity Spreadsheet -- Enzyme Inhibition Constant Data from BindingDB
Found 15 hits for monomerid = 305561
TargetProto-oncogene tyrosine-protein kinase receptor Ret(Homo sapiens (Human))
Array Biopharma
US Patent
LigandPNGBDBM305561(US10144734, Example 578 | US10172845, Example 578 ...)
Affinity DataIC50:  9.80nM. Assay description: Compounds of Formula I were screened for their ability to inhibit wildtype and V804M mutant RET kinase using CisBio's HTRF KinEASE-TK assay techn...
Ligand InfoPC cidPC sid
In DepthDetails US Patent
TargetProto-oncogene tyrosine-protein kinase receptor Ret [G810R](Homo sapiens (Human))
Array Biopharma
US Patent
LigandPNGBDBM305561(US10144734, Example 578 | US10172845, Example 578 ...)
Affinity DataIC50:  51nM. Assay description: The potency of a compound inhibiting G810R mutant RET kinase was determined using CisBio's HTRF Kinease-TK assay technology. The assays contained...
Ligand InfoPC cidPC sid
In DepthDetails US Patent
TargetProto-oncogene tyrosine-protein kinase receptor Ret [G810R](Homo sapiens (Human))
Array Biopharma
US Patent
LigandPNGBDBM305561(US10144734, Example 578 | US10172845, Example 578 ...)
Affinity DataIC50:  51nM. Assay description: The potency of a compound inhibiting G81 OR mutant RET kinase was determined using CisBio's HTRF Kinease-TK assay technology. The assays containe...
Ligand InfoPC cidPC sid
In DepthDetails US Patent
TargetProto-oncogene tyrosine-protein kinase receptor Ret [658-1114](Homo sapiens (Human))
Array Biopharma
US Patent
LigandPNGBDBM305561(US10144734, Example 578 | US10172845, Example 578 ...)
Affinity DataIC50:  9.80nM. Assay description: Compounds of Formula I were screened for their ability to inhibit wildtype and V804M mutant RET kinase using CisBio's HTRF® KinEASE-TK assay tech...
Ligand InfoPC cidPC sid
In DepthDetails US Patent
TargetProto-oncogene tyrosine-protein kinase receptor Ret [658-1114,V804M](Homo sapiens (Human))
Array Biopharma
US Patent
LigandPNGBDBM305561(US10144734, Example 578 | US10172845, Example 578 ...)
Affinity DataIC50:  43.7nM. Assay description: Compounds of Formula I were screened for their ability to inhibit wildtype and V804M mutant RET kinase using CisBio's HTRF® KinEASE-TK assay tech...
Ligand InfoPC cidPC sid
In DepthDetails US Patent
TargetProto-oncogene tyrosine-protein kinase receptor Ret [G810R](Homo sapiens (Human))
Array Biopharma
US Patent
LigandPNGBDBM305561(US10144734, Example 578 | US10172845, Example 578 ...)
Affinity DataIC50:  51nM. Assay description: The potency of a compound inhibiting G810R mutant RET kinase was determined using CisBio's HTRF Kinease-TK assay technology. The assays contained...
Ligand InfoPC cidPC sid
In DepthDetails US Patent
TargetProto-oncogene tyrosine-protein kinase receptor Ret [658-1114,V804M](Homo sapiens (Human))
Array Biopharma
US Patent
LigandPNGBDBM305561(US10144734, Example 578 | US10172845, Example 578 ...)
Affinity DataIC50:  9.80nM. Assay description: Compounds of Formula I were screened for their ability to inhibit wildtype and V804M mutant RET kinase using CisBio's HTRF KinEASE-TK assay techn...
Ligand InfoPC cidPC sid
In DepthDetails US Patent
TargetProto-oncogene tyrosine-protein kinase receptor Ret [G810R](Homo sapiens (Human))
Array Biopharma
US Patent
LigandPNGBDBM305561(US10144734, Example 578 | US10172845, Example 578 ...)
Affinity DataIC50:  43.7nM. Assay description: The potency of a compound inhibiting G810R mutant RET kinase was determined using CisBio's HTRF Kinease-TK assay technology. The assays contained...
Ligand InfoPC cidPC sid
In DepthDetails US Patent
TargetProto-oncogene tyrosine-protein kinase receptor Ret [V804M](Homo sapiens (Human))
Array Biopharma
US Patent
LigandPNGBDBM305561(US10144734, Example 578 | US10172845, Example 578 ...)
Affinity DataIC50:  51nM. Assay description: The potency of a compound inhibiting G810R mutant RET kinase was determined using CisBio's HTRF Kinease-TK assay technology. The assays contained...
Ligand InfoPC cidPC sid
In DepthDetails US Patent
TargetProto-oncogene tyrosine-protein kinase receptor Ret(Homo sapiens (Human))
Array Biopharma
US Patent
LigandPNGBDBM305561(US10144734, Example 578 | US10172845, Example 578 ...)
Affinity DataIC50:  9.80nM. Assay description: Wildtype and V804M mutant: Compounds of Formula I were screened for their ability to inhibit wildtype and V804M mutant RET kinase using CisBio's ...
Ligand InfoPC cidPC sid
In DepthDetails US Patent
TargetProto-oncogene tyrosine-protein kinase receptor Ret [V804M](Homo sapiens (Human))
Array Biopharma
US Patent
LigandPNGBDBM305561(US10144734, Example 578 | US10172845, Example 578 ...)
Affinity DataIC50:  43.7nM. Assay description: Wildtype and V804M mutant: Compounds of Formula I were screened for their ability to inhibit wildtype and V804M mutant RET kinase using CisBio's ...
Ligand InfoPC cidPC sid
In DepthDetails US Patent
TargetProto-oncogene tyrosine-protein kinase receptor Ret [G810R](Homo sapiens (Human))
Array Biopharma
US Patent
LigandPNGBDBM305561(US10144734, Example 578 | US10172845, Example 578 ...)
Affinity DataIC50:  51nM. Assay description: The potency of a compound inhibiting G81 OR mutant RET kinase was determined using CisBio's HTRF Kinease-TK assay technology. The assays containe...
Ligand InfoPC cidPC sid
In DepthDetails US Patent
TargetProto-oncogene tyrosine-protein kinase receptor Ret [658-1114,V804M](Homo sapiens (Human))
Array Biopharma
US Patent
LigandPNGBDBM305561(US10144734, Example 578 | US10172845, Example 578 ...)
Affinity DataIC50:  9.80nM. Assay description: Compounds of Formula I were screened for their ability to inhibit wildtype and V804M mutant RET kinase using CisBio's HTRF® KinEASE™-TK assay tec...
Ligand InfoPC cidPC sid
In DepthDetails US Patent
TargetProto-oncogene tyrosine-protein kinase receptor Ret [V804M](Homo sapiens (Human))
Array Biopharma
US Patent
LigandPNGBDBM305561(US10144734, Example 578 | US10172845, Example 578 ...)
Affinity DataIC50:  43.7nM. Assay description: Compounds of Formula I were screened for their ability to inhibit wildtype and V804M mutant RET kinase using CisBio's HTRF® KinEASE™-TK assay tec...
Ligand InfoPC cidPC sid
In DepthDetails US Patent
TargetProto-oncogene tyrosine-protein kinase receptor Ret [V804M](Homo sapiens (Human))
Array Biopharma
US Patent
LigandPNGBDBM305561(US10144734, Example 578 | US10172845, Example 578 ...)
Affinity DataIC50:  43.7nM. Assay description: Compounds of Formula I were screened for their ability to inhibit wildtype and V804M mutant RET kinase using CisBio's HTRF KinEASE-TK assay techn...
Ligand InfoPC cidPC sid
In DepthDetails US Patent