BDBM305729 6-(2-hydroxy-2- methylpropoxy)-4-(6-(4- hydroxy-4-(4- methylbenzyl)piperidin- 1-yl)pyridin-3- yl)pyrazolo[1,5-a] pyridine-3-carbonitrile::US10144734, Example 747::US10172845, Example 747::US10441581, Example 747::US10881652, Example 747::US11648243, Example 747
SMILES Cc1ccc(CC2(O)CCN(CC2)c2ccc(cn2)-c2cc(OCC(C)(C)O)cn3ncc(C#N)c23)cc1
InChI Key InChIKey=BBPBSSVBBBPANM-UHFFFAOYSA-N
Data  15 IC50
  Tab Delimited (TSV)   2D SDfile   Computed 3D by Vconf -m prep SDfile
Find this compound or compounds like it in BindingDB:
Activity Spreadsheet -- Enzyme Inhibition Constant Data from BindingDB
Found 15 hits for monomerid = 305729
TargetProto-oncogene tyrosine-protein kinase receptor Ret(Homo sapiens (Human))
Array Biopharma
US Patent
LigandPNGBDBM305729(6-(2-hydroxy-2- methylpropoxy)-4-(6-(4- hydroxy-4-...)
Affinity DataIC50:  19nM. Assay description: Compounds of Formula I were screened for their ability to inhibit wildtype and V804M mutant RET kinase using CisBio's HTRF KinEASE-TK assay techn...
Ligand InfoPC cidPC sid
In DepthDetails US Patent
TargetProto-oncogene tyrosine-protein kinase receptor Ret [G810R](Homo sapiens (Human))
Array Biopharma
US Patent
LigandPNGBDBM305729(6-(2-hydroxy-2- methylpropoxy)-4-(6-(4- hydroxy-4-...)
Affinity DataIC50:  1.49E+3nM. Assay description: The potency of a compound inhibiting G810R mutant RET kinase was determined using CisBio's HTRF Kinease-TK assay technology. The assays contained...
Ligand InfoPC cidPC sid
In DepthDetails US Patent
TargetProto-oncogene tyrosine-protein kinase receptor Ret [G810R](Homo sapiens (Human))
Array Biopharma
US Patent
LigandPNGBDBM305729(6-(2-hydroxy-2- methylpropoxy)-4-(6-(4- hydroxy-4-...)
Affinity DataIC50:  1.49E+3nM. Assay description: The potency of a compound inhibiting G81 OR mutant RET kinase was determined using CisBio's HTRF Kinease-TK assay technology. The assays containe...
Ligand InfoPC cidPC sid
In DepthDetails US Patent
TargetProto-oncogene tyrosine-protein kinase receptor Ret [658-1114](Homo sapiens (Human))
Array Biopharma
US Patent
LigandPNGBDBM305729(6-(2-hydroxy-2- methylpropoxy)-4-(6-(4- hydroxy-4-...)
Affinity DataIC50:  19nM. Assay description: Compounds of Formula I were screened for their ability to inhibit wildtype and V804M mutant RET kinase using CisBio's HTRF® KinEASE-TK assay tech...
Ligand InfoPC cidPC sid
In DepthDetails US Patent
TargetProto-oncogene tyrosine-protein kinase receptor Ret [658-1114,V804M](Homo sapiens (Human))
Array Biopharma
US Patent
LigandPNGBDBM305729(6-(2-hydroxy-2- methylpropoxy)-4-(6-(4- hydroxy-4-...)
Affinity DataIC50:  66nM. Assay description: Compounds of Formula I were screened for their ability to inhibit wildtype and V804M mutant RET kinase using CisBio's HTRF® KinEASE-TK assay tech...
Ligand InfoPC cidPC sid
In DepthDetails US Patent
TargetProto-oncogene tyrosine-protein kinase receptor Ret [G810R](Homo sapiens (Human))
Array Biopharma
US Patent
LigandPNGBDBM305729(6-(2-hydroxy-2- methylpropoxy)-4-(6-(4- hydroxy-4-...)
Affinity DataIC50:  1.49E+3nM. Assay description: The potency of a compound inhibiting G810R mutant RET kinase was determined using CisBio's HTRF Kinease-TK assay technology. The assays contained...
Ligand InfoPC cidPC sid
In DepthDetails US Patent
TargetProto-oncogene tyrosine-protein kinase receptor Ret [658-1114,V804M](Homo sapiens (Human))
Array Biopharma
US Patent
LigandPNGBDBM305729(6-(2-hydroxy-2- methylpropoxy)-4-(6-(4- hydroxy-4-...)
Affinity DataIC50:  19nM. Assay description: Compounds of Formula I were screened for their ability to inhibit wildtype and V804M mutant RET kinase using CisBio's HTRF KinEASE-TK assay techn...
Ligand InfoPC cidPC sid
In DepthDetails US Patent
TargetProto-oncogene tyrosine-protein kinase receptor Ret [G810R](Homo sapiens (Human))
Array Biopharma
US Patent
LigandPNGBDBM305729(6-(2-hydroxy-2- methylpropoxy)-4-(6-(4- hydroxy-4-...)
Affinity DataIC50:  66nM. Assay description: The potency of a compound inhibiting G810R mutant RET kinase was determined using CisBio's HTRF Kinease-TK assay technology. The assays contained...
Ligand InfoPC cidPC sid
In DepthDetails US Patent
TargetProto-oncogene tyrosine-protein kinase receptor Ret [V804M](Homo sapiens (Human))
Array Biopharma
US Patent
LigandPNGBDBM305729(6-(2-hydroxy-2- methylpropoxy)-4-(6-(4- hydroxy-4-...)
Affinity DataIC50:  1.49E+3nM. Assay description: The potency of a compound inhibiting G810R mutant RET kinase was determined using CisBio's HTRF Kinease-TK assay technology. The assays contained...
Ligand InfoPC cidPC sid
In DepthDetails US Patent
TargetProto-oncogene tyrosine-protein kinase receptor Ret(Homo sapiens (Human))
Array Biopharma
US Patent
LigandPNGBDBM305729(6-(2-hydroxy-2- methylpropoxy)-4-(6-(4- hydroxy-4-...)
Affinity DataIC50:  19nM. Assay description: Wildtype and V804M mutant: Compounds of Formula I were screened for their ability to inhibit wildtype and V804M mutant RET kinase using CisBio's ...
Ligand InfoPC cidPC sid
In DepthDetails US Patent
TargetProto-oncogene tyrosine-protein kinase receptor Ret [V804M](Homo sapiens (Human))
Array Biopharma
US Patent
LigandPNGBDBM305729(6-(2-hydroxy-2- methylpropoxy)-4-(6-(4- hydroxy-4-...)
Affinity DataIC50:  66nM. Assay description: Wildtype and V804M mutant: Compounds of Formula I were screened for their ability to inhibit wildtype and V804M mutant RET kinase using CisBio's ...
Ligand InfoPC cidPC sid
In DepthDetails US Patent
TargetProto-oncogene tyrosine-protein kinase receptor Ret [G810R](Homo sapiens (Human))
Array Biopharma
US Patent
LigandPNGBDBM305729(6-(2-hydroxy-2- methylpropoxy)-4-(6-(4- hydroxy-4-...)
Affinity DataIC50:  1.49E+3nM. Assay description: The potency of a compound inhibiting G81 OR mutant RET kinase was determined using CisBio's HTRF Kinease-TK assay technology. The assays containe...
Ligand InfoPC cidPC sid
In DepthDetails US Patent
TargetProto-oncogene tyrosine-protein kinase receptor Ret [658-1114,V804M](Homo sapiens (Human))
Array Biopharma
US Patent
LigandPNGBDBM305729(6-(2-hydroxy-2- methylpropoxy)-4-(6-(4- hydroxy-4-...)
Affinity DataIC50:  19nM. Assay description: Compounds of Formula I were screened for their ability to inhibit wildtype and V804M mutant RET kinase using CisBio's HTRF® KinEASE™-TK assay tec...
Ligand InfoPC cidPC sid
In DepthDetails US Patent
TargetProto-oncogene tyrosine-protein kinase receptor Ret [V804M](Homo sapiens (Human))
Array Biopharma
US Patent
LigandPNGBDBM305729(6-(2-hydroxy-2- methylpropoxy)-4-(6-(4- hydroxy-4-...)
Affinity DataIC50:  66nM. Assay description: Compounds of Formula I were screened for their ability to inhibit wildtype and V804M mutant RET kinase using CisBio's HTRF® KinEASE™-TK assay tec...
Ligand InfoPC cidPC sid
In DepthDetails US Patent
TargetProto-oncogene tyrosine-protein kinase receptor Ret [V804M](Homo sapiens (Human))
Array Biopharma
US Patent
LigandPNGBDBM305729(6-(2-hydroxy-2- methylpropoxy)-4-(6-(4- hydroxy-4-...)
Affinity DataIC50:  66nM. Assay description: Compounds of Formula I were screened for their ability to inhibit wildtype and V804M mutant RET kinase using CisBio's HTRF KinEASE-TK assay techn...
Ligand InfoPC cidPC sid
In DepthDetails US Patent