BDBM305906 US10144742, Compound I-68
SMILES Cn1cc2CN(CCOc2n1)C(=O)c1ccc2nc(-c3ccc(F)cc3)c(nc2c1)-c1ccc(F)cc1
InChI Key InChIKey=FOEWWLQEFQBUOE-UHFFFAOYSA-N
Data  1 IC50
  Tab Delimited (TSV)   2D SDfile   Computed 3D by Vconf -m prep SDfile
Find this compound or compounds like it in BindingDB:
Activity Spreadsheet -- Enzyme Inhibition Constant Data from BindingDB
Found 1 hit for monomerid = 305906
TargetNicotinamide phosphoribosyltransferase(Homo sapiens (Human))
Millennium Pharmaceuticals
US Patent
LigandPNGBDBM305906(US10144742, Compound I-68)
Affinity DataIC50:  6.00E+3nM. Assay description: To measure the inhibition of NAMPT activity hNAMPT protein stock and anti 6His-Tb (Cisbio; Cat. No. 61HISTLB) is diluted to 3× final concentration wi...
Ligand InfoPC cidPC sid
In DepthDetails US Patent