BDBM305909 US10144742, Compound I-71
SMILES O=C(NCCc1ncc[nH]1)c1ccc2nc(N3CCC(CC3)N3CCOCC3)c(nc2c1)-c1ccccc1
InChI Key InChIKey=ONWMOHQXQRRVNK-UHFFFAOYSA-N
Data  1 IC50
  Tab Delimited (TSV)   2D SDfile   Computed 3D by Vconf -m prep SDfile
Find this compound or compounds like it in BindingDB:
Activity Spreadsheet -- Enzyme Inhibition Constant Data from BindingDB
Found 1 hit for monomerid = 305909
TargetNicotinamide phosphoribosyltransferase(Homo sapiens (Human))
Millennium Pharmaceuticals
US Patent
LigandPNGBDBM305909(US10144742, Compound I-71)
Affinity DataIC50:  300nM. Assay description: To measure the inhibition of NAMPT activity hNAMPT protein stock and anti 6His-Tb (Cisbio; Cat. No. 61HISTLB) is diluted to 3× final concentration wi...
Ligand InfoPC cidPC sid
In DepthDetails US Patent