BDBM306023 US10144742, Compound I-185
SMILES Cc1ccc(CCCNC(=O)c2ccc3nc(N4CCCCC4)c(nc3c2)-c2ccc(F)cc2)cn1
InChI Key InChIKey=CULNCXXPBHPVFE-UHFFFAOYSA-N
Data  1 IC50
  Tab Delimited (TSV)   2D SDfile   Computed 3D by Vconf -m prep SDfile
Find this compound or compounds like it in BindingDB:
Activity Spreadsheet -- Enzyme Inhibition Constant Data from BindingDB
Found 1 hit for monomerid = 306023
TargetNicotinamide phosphoribosyltransferase(Homo sapiens (Human))
Millennium Pharmaceuticals
US Patent
LigandPNGBDBM306023(US10144742, Compound I-185)
Affinity DataIC50:  750nM. Assay description: To measure the inhibition of NAMPT activity hNAMPT protein stock and anti 6His-Tb (Cisbio; Cat. No. 61HISTLB) is diluted to 3× final concentration wi...
Ligand InfoPC cidPC sid
In DepthDetails US Patent