BDBM306066 US10144742, Compound I-228
SMILES CCOc1cccc(c1)-c1nc2ccc(cc2nc1-c1ccccc1)C(=O)NCCCn1ccnc1
InChI Key InChIKey=WYRXNEXWFOWMQP-UHFFFAOYSA-N
Data  1 IC50
  Tab Delimited (TSV)   2D SDfile   Computed 3D by Vconf -m prep SDfile
Find this compound or compounds like it in BindingDB:
Activity Spreadsheet -- Enzyme Inhibition Constant Data from BindingDB
Found 1 hit for monomerid = 306066
TargetNicotinamide phosphoribosyltransferase(Homo sapiens (Human))
Millennium Pharmaceuticals
US Patent
LigandPNGBDBM306066(US10144742, Compound I-228)
Affinity DataIC50:  300nM. Assay description: To measure the inhibition of NAMPT activity hNAMPT protein stock and anti 6His-Tb (Cisbio; Cat. No. 61HISTLB) is diluted to 3× final concentration wi...
Ligand InfoPC cidPC sid
In DepthDetails US Patent