BDBM307198 US10150728, Example I-411
SMILES C[C@@H](CO[C@H]1C[C@H](COc2ncnc(OCc3csc(Cl)n3)c2Cl)C1)NC(C)=O
InChI Key InChIKey=LWDOOKICZURVRG-JKOKRWQUSA-N
Data  1 IC50
  Tab Delimited (TSV)   2D SDfile   Computed 3D by Vconf -m prep SDfile
Find this compound or compounds like it in BindingDB:
Activity Spreadsheet -- Enzyme Inhibition Constant Data from BindingDB
Found 1 hit for monomerid = 307198
TargetAcetyl-CoA carboxylase 2(Homo sapiens (Human))
Shionogi
US Patent
LigandPNGBDBM307198(US10150728, Example I-411)
Affinity DataIC50:  937nM. Assay description: Recombinant human ACC1 and recombinant human ACC2, which were prepared by the method mentioned above, were preincubated with assay buffer solution (5...
Ligand InfoPC cidPC sid
In DepthDetails US Patent