BDBM307273 US10150728, Example I-486
SMILES C[C@@H](CO[C@H]1C[C@H](COc2cc(C)c3nc(OCC4CC4)n(C)c3n2)C1)NC(C)=O
InChI Key InChIKey=BNZFVMJJPGAXCB-WBAXXEDZSA-N
Data  1 IC50
  Tab Delimited (TSV)   2D SDfile   Computed 3D by Vconf -m prep SDfile
Find this compound or compounds like it in BindingDB:
Activity Spreadsheet -- Enzyme Inhibition Constant Data from BindingDB
Found 1 hit for monomerid = 307273
TargetAcetyl-CoA carboxylase 2(Homo sapiens (Human))
Shionogi
US Patent
LigandPNGBDBM307273(US10150728, Example I-486)
Affinity DataIC50:  724nM. Assay description: Recombinant human ACC1 and recombinant human ACC2, which were prepared by the method mentioned above, were preincubated with assay buffer solution (5...
Ligand InfoPC cidPC sid
In DepthDetails US Patent