BDBM30728 MLS000039121::N-(6,7-dihydro-5H-cyclopenta[d]pyrimidin-4-yl)-1-adamantanecarboxamide::N-(6,7-dihydro-5H-cyclopenta[d]pyrimidin-4-yl)adamantane-1-carboxamide::SMR000040059::cid_659037
SMILES [H]C12CC3([H])CC([H])(C1)CC(C2)(C3)C(=O)Nc1ncnc2CCCc12
InChI Key InChIKey=IXKDKBSIWFCSDM-UHFFFAOYSA-N
Data  1 EC50
  Tab Delimited (TSV)   2D SDfile   Computed 3D by Vconf -m prep SDfile
Find this compound or compounds like it in BindingDB:
Activity Spreadsheet -- Enzyme Inhibition Constant Data from BindingDB
Found 1 hit for monomerid = 30728
Target5-hydroxytryptamine receptor 1A(Homo sapiens (Human))
The Scripps Research Institute Molecular Screening Center
Curated by PubChem BioAssay
LigandPNGBDBM30728(MLS000039121 | N-(6,7-dihydro-5H-cyclopenta[d]pyri...)
Affinity DataEC50:  9.90E+4nMpH: 7.4 T: 2°C. Assay description: A cell line containing the human 5-HT1a receptor, the promiscuous G-alpha-15 protein (Ga15) as well as the beta-lactamase (BLA) reporter-gene under c...
In DepthDetails PCBioAssay