BDBM307334 US10150728, Example I-548
SMILES C[C@@H](CO[C@H]1CC[C@@H](CC1)Oc1ncc2cc(OCC3CC3)ccc2n1)NC(C)=O
InChI Key InChIKey=OTYNGWHKKWJVAD-YSSFQJQWSA-N
Data  1 IC50
  Tab Delimited (TSV)   2D SDfile   Computed 3D by Vconf -m prep SDfile
Find this compound or compounds like it in BindingDB:
Activity Spreadsheet -- Enzyme Inhibition Constant Data from BindingDB
Found 1 hit for monomerid = 307334
TargetAcetyl-CoA carboxylase 2(Homo sapiens (Human))
Shionogi
US Patent
LigandPNGBDBM307334(US10150728, Example I-548)
Affinity DataIC50:  124nM. Assay description: Recombinant human ACC1 and recombinant human ACC2, which were prepared by the method mentioned above, were preincubated with assay buffer solution (5...
Ligand InfoPC cidPC sid
In DepthDetails US Patent