BDBM30736 2-(2-amino-3-cyanopyrrolo[3,2-b]quinoxalin-1-yl)ethyl 3-bromobenzoate::2-(2-azanyl-3-cyano-pyrrolo[3,2-b]quinoxalin-1-yl)ethyl 3-bromanylbenzoate::3-bromobenzoic acid 2-(2-amino-3-cyano-1-pyrrolo[3,2-b]quinoxalinyl)ethyl ester::3-bromobenzoic acid 2-(2-amino-3-cyano-pyrrolo[3,2-b]quinoxalin-1-yl)ethyl ester::MLS000037325::SMR000040752::cid_659825
SMILES Nc1c(C#N)c2nc3ccccc3nc2n1CCOC(=O)c1cccc(Br)c1
InChI Key InChIKey=WNBNWGPEJCANAH-UHFFFAOYSA-N
Data  2 EC50
  Tab Delimited (TSV)   2D SDfile   Computed 3D by Vconf -m prep SDfile
Find this compound or compounds like it in BindingDB:
Activity Spreadsheet -- Enzyme Inhibition Constant Data from BindingDB
Found 2 hits for monomerid = 30736
TargetMultidrug resistance-associated protein 1(Homo sapiens (Human))
Srmlsc
Curated by PubChem BioAssay
LigandPNGBDBM30736(2-(2-amino-3-cyanopyrrolo[3,2-b]quinoxalin-1-yl)et...)
Affinity DataEC50:  5.04E+3nM. Assay description: Southern Research Molecular Libraries Screening Center (SRMLSC) Southern Research Institute (Birmingham, Alabama) NIH Molecular Libraries Screening C...
In DepthDetails PCBioAssay
Target5-hydroxytryptamine receptor 1A(Homo sapiens (Human))
The Scripps Research Institute Molecular Screening Center
Curated by PubChem BioAssay
LigandPNGBDBM30736(2-(2-amino-3-cyanopyrrolo[3,2-b]quinoxalin-1-yl)et...)
Affinity DataEC50:  4.25E+4nMpH: 7.4 T: 2°C. Assay description: A cell line containing the human 5-HT1a receptor, the promiscuous G-alpha-15 protein (Ga15) as well as the beta-lactamase (BLA) reporter-gene under c...
In DepthDetails PCBioAssay