BDBM307623 2-(6-(4-cyclopropyl- 4H-1,2,4-triazol-3- yl)pyridin-2-yl)-5- (4- (dimethylamino) piperidine-1- carbonyl)isoindolin- 1-one::US10150755, Compound 15
SMILES CN(C)C1CCN(CC1)C(=O)c1ccc2C(=O)N(Cc2c1)c1cccc(n1)-c1nncn1C1CC1
InChI Key InChIKey=PIFFPSGBNLRYOX-UHFFFAOYSA-N
Data  1 KI  3 IC50
  Tab Delimited (TSV)   2D SDfile   Computed 3D by Vconf -m prep SDfile
Find this compound or compounds like it in BindingDB:
Activity Spreadsheet -- Enzyme Inhibition Constant Data from BindingDB
Found 4 hits for monomerid = 307623
TargetMitogen-activated protein kinase kinase kinase 5(Homo sapiens (Human))
Seal Rock Therapeutics
US Patent
LigandPNGBDBM307623(2-(6-(4-cyclopropyl- 4H-1,2,4-triazol-3- yl)pyridi...)
Affinity DataKi: <200nM. Assay description: The ASK1 enzymatic assay was run following Promega ASK1 Kinase Enzyme System (Cat #V3881). The kit provides the protocol, enzymes and all reagents ne...
Ligand InfoPC cidPC sid
In DepthDetails US Patent
TargetMitogen-activated protein kinase kinase kinase 5(Homo sapiens (Human))
Seal Rock Therapeutics
US Patent
LigandPNGBDBM307623(2-(6-(4-cyclopropyl- 4H-1,2,4-triazol-3- yl)pyridi...)
Affinity DataIC50: <200nM. Assay description: The ASK1 enzymatic assay was run following Promega ASK1 Kinase Enzyme System (Cat #V3881). The kit provides the protocol, enzymes and all reagents ne...
Ligand InfoPC cidPC sid
In DepthDetails US Patent
TargetTumor necrosis factor(Homo sapiens (Human))
Seal Rock Therapeutics
US Patent
LigandPNGBDBM307623(2-(6-(4-cyclopropyl- 4H-1,2,4-triazol-3- yl)pyridi...)
Affinity DataIC50:  6.00E+3nM. Assay description: Cryopreserved human PBMCs were obtained from AllCells (cat# PB003F). After thawing/dilution protocols using RPMI medium supplemented with 5% FBS (hea...
Ligand InfoPC cidPC sid
In DepthDetails US Patent
TargetTumor necrosis factor(Homo sapiens (Human))
Seal Rock Therapeutics
US Patent
LigandPNGBDBM307623(2-(6-(4-cyclopropyl- 4H-1,2,4-triazol-3- yl)pyridi...)
Affinity DataIC50:  600nM. Assay description: Cryopreserved human PBMCs were obtained from AllCells (cat# PB003F). After thawing/dilution protocols using RPMI medium supplemented with 5% FBS (hea...
Ligand InfoPC cidPC sid
In DepthDetails US Patent