BDBM307645 2-(6-(4-cyclopropyl-4H-1,2,4-triazol-3-yl)pyridin-2-yl)-6-(1H-imidazol-1-yl)isoindolin-1-one ::US10150755, Compound 37
SMILES O=C1N(Cc2ccc(cc12)-n1ccnc1)c1cccc(n1)-c1nncn1C1CC1
InChI Key InChIKey=QHRICJJUGQAFQL-UHFFFAOYSA-N
Data  1 KI  1 IC50
  Tab Delimited (TSV)   2D SDfile   Computed 3D by Vconf -m prep SDfile
Find this compound or compounds like it in BindingDB:
Activity Spreadsheet -- Enzyme Inhibition Constant Data from BindingDB
Found 2 hits for monomerid = 307645
TargetMitogen-activated protein kinase kinase kinase 5(Homo sapiens (Human))
Seal Rock Therapeutics
US Patent
LigandPNGBDBM307645(2-(6-(4-cyclopropyl-4H-1,2,4-triazol-3-yl)pyridin-...)
Affinity DataKi: <200nM. Assay description: The ASK1 enzymatic assay was run following Promega ASK1 Kinase Enzyme System (Cat #V3881). The kit provides the protocol, enzymes and all reagents ne...
Ligand InfoPC cidPC sid
In DepthDetails US Patent
TargetMitogen-activated protein kinase kinase kinase 5(Homo sapiens (Human))
Seal Rock Therapeutics
US Patent
LigandPNGBDBM307645(2-(6-(4-cyclopropyl-4H-1,2,4-triazol-3-yl)pyridin-...)
Affinity DataIC50: <200nM. Assay description: The ASK1 enzymatic assay was run following Promega ASK1 Kinase Enzyme System (Cat #V3881). The kit provides the protocol, enzymes and all reagents ne...
Ligand InfoPC cidPC sid
In DepthDetails US Patent