BDBM307740 N-benzyl-N′-{5-chloro-4-[1-(3-fluorobenzyl)-1H-benzimidazol-6-yl]pyridin-2-yl}-N-methylpropane-1,3-diamine::US9650358, Example 36
SMILES CN(CCCNc1cc(c(Cl)cn1)-c1ccc2ncn(Cc3cccc(F)c3)c2c1)Cc1ccccc1
InChI Key InChIKey=DTKOBGLSTHHENQ-UHFFFAOYSA-N
Data  1 IC50
  Tab Delimited (TSV)   2D SDfile   Computed 3D by Vconf -m prep SDfile
Find this compound or compounds like it in BindingDB:
Activity Spreadsheet -- Enzyme Inhibition Constant Data from BindingDB
Found 1 hit for monomerid = 307740
TargetCyclin-dependent kinase 9(Homo sapiens (Human))
Abbvie
US Patent
LigandPNGBDBM307740( N-benzyl-N′-{5-chloro-4-[1-(3-fluorobenzyl)...)
Affinity DataIC50:  760nM. Assay description: CDK9 enzyme activities were measured using LANCE ULight TR-FRET kinase assay reagents (PerkinElmer, Waltham, Mass.). Compounds were directly added in...
Ligand InfoPC cidPC sid
In DepthDetails US Patent