BDBM307884 N-{5-chloro-4-[1-(tetrahydro-2H-pyran-4-ylmethyl)-1H-benzimidazol-6-yl]pyridin-2-yl}-7-(methylsulfonyl)-7-azaspiro[3.5]nonan-2-amine::US9650358, Example 180
SMILES CS(=O)(=O)N1CCC2(CC(C2)Nc2cc(c(Cl)cn2)-c2ccc3ncn(CC4CCOCC4)c3c2)CC1
InChI Key InChIKey=ICNNAHHOVFMSDX-UHFFFAOYSA-N
Data  1 IC50
  Tab Delimited (TSV)   2D SDfile   Computed 3D by Vconf -m prep SDfile
Find this compound or compounds like it in BindingDB:
Activity Spreadsheet -- Enzyme Inhibition Constant Data from BindingDB
Found 1 hit for monomerid = 307884
TargetCyclin-dependent kinase 9(Homo sapiens (Human))
Abbvie
US Patent
LigandPNGBDBM307884(N-{5-chloro-4-[1-(tetrahydro-2H-pyran-4-ylmethyl)-...)
Affinity DataIC50:  180nM. Assay description: CDK9 enzyme activities were measured using LANCE ULight TR-FRET kinase assay reagents (PerkinElmer, Waltham, Mass.). Compounds were directly added in...
Ligand InfoPC cidPC sid
In DepthDetails US Patent