BDBM308313 US9649309, Compound UNC4333A
SMILES CCCCNc1ncc(c(N[C@H]2CC[C@H](O)CC2)n1)-c1cc(Nc2cccc(c2)C(C)(C)C)ncn1
InChI Key InChIKey=MZDSZIKAVUIXKJ-AQYVVDRMSA-N
Data  4 IC50
  Tab Delimited (TSV)   2D SDfile   Computed 3D by Vconf -m prep SDfile
Find this compound or compounds like it in BindingDB:
Activity Spreadsheet -- Enzyme Inhibition Constant Data from BindingDB
Found 4 hits for monomerid = 308313
TargetTyrosine-protein kinase receptor TYRO3(Homo sapiens (Human))
University Of North Carolina At Chapel Hill
US Patent
LigandPNGBDBM308313(US9649309, Compound UNC4333A)
Affinity DataIC50:  3.00E+4nM. Assay description: Briefly, activity assays were performed in a 384 well, polypropylene microplate in a final volume of 50 μL of 50 mM Hepes, Ph 7.4 containing 10 ...
Ligand InfoPC cidPC sid
In DepthDetails US Patent
TargetReceptor-type tyrosine-protein kinase FLT3(Homo sapiens (Human))
University Of North Carolina At Chapel Hill
US Patent
LigandPNGBDBM308313(US9649309, Compound UNC4333A)
Affinity DataIC50:  160nM. Assay description: Briefly, activity assays were performed in a 384 well, polypropylene microplate in a final volume of 50 μL of 50 mM Hepes, Ph 7.4 containing 10 ...
Ligand InfoPC cidPC sid
In DepthDetails US Patent
TargetGrowth arrest-specific protein 6(Homo sapiens (Human))
University Of North Carolina At Chapel Hill
US Patent
LigandPNGBDBM308313(US9649309, Compound UNC4333A)
Affinity DataIC50:  867nM. Assay description: Briefly, activity assays were performed in a 384 well, polypropylene microplate in a final volume of 50 μL of 50 mM Hepes, Ph 7.4 containing 10 ...
Ligand InfoPC cidPC sid
In DepthDetails US Patent
TargetTyrosine-protein kinase Mer(Homo sapiens (Human))
University Of North Carolina At Chapel Hill
US Patent
LigandPNGBDBM308313(US9649309, Compound UNC4333A)
Affinity DataIC50:  7.80nM. Assay description: Briefly, activity assays were performed in a 384 well, polypropylene microplate in a final volume of 50 μL of 50 mM Hepes, Ph 7.4 containing 10 ...
Ligand InfoPC cidPC sid
In DepthDetails US Patent