BDBM308409 US9649309, Compound UNC2064A
SMILES CCCCNc1ncc(C(=O)Nc2ccc(cc2)S(=O)(=O)N2CCOCC2)c(NCCOCCO)n1
InChI Key InChIKey=YYGQLKFOBPPKRW-UHFFFAOYSA-N
Data  1 IC50
  Tab Delimited (TSV)   2D SDfile   Computed 3D by Vconf -m prep SDfile
Find this compound or compounds like it in BindingDB:
Activity Spreadsheet -- Enzyme Inhibition Constant Data from BindingDB
Found 1 hit for monomerid = 308409
TargetTyrosine-protein kinase Mer(Homo sapiens (Human))
University Of North Carolina At Chapel Hill
US Patent
LigandPNGBDBM308409(US9649309, Compound UNC2064A)
Affinity DataIC50:  550nM. Assay description: Briefly, activity assays were performed in a 384 well, polypropylene microplate in a final volume of 50 μL of 50 mM Hepes, Ph 7.4 containing 10 ...
Ligand InfoPC cidPC sid
In DepthDetails US Patent