BDBM308499 3-fluoro-N-{trans-1-[(1-methyl-1H-imidazol-4-yl)sulfonyl]-4-phenylpyrrolidin-3-yl}benzamide::US9656955, Example 18
SMILES Cn1cnc(c1)S(=O)(=O)N1C[C@@H](NC(=O)c2cccc(F)c2)[C@@H](C1)c1ccccc1
InChI Key InChIKey=CNPPGHHHDFTPND-RBUKOAKNSA-N
Data  1 KI
  Tab Delimited (TSV)   2D SDfile   Computed 3D by Vconf -m prep SDfile
Find this compound or compounds like it in BindingDB:
Activity Spreadsheet -- Enzyme Inhibition Constant Data from BindingDB
Found 1 hit for monomerid = 308499
LigandPNGBDBM308499(3-fluoro-N-{trans-1-[(1-methyl-1H-imidazol-4-yl)su...)
Affinity DataKi: <1.00E+4nM. Assay description: Radioligand binding assays using recombinant CHO cell membranes expressing human GlyT1: Radioligand binding to human GlyT1c transporter-expressing me...
Ligand InfoPC cidPC sid
In DepthDetails US Patent