BDBM308759 Trans-4-(4-fluorophenyl)-1-[(1-methyl-1H-imidazol-4-yl)sulfonyl]-N-[3-(trifluoromethoxy)phenyl]pyrrolidine-3-carboxamide::US9656955, Example 273
SMILES Cn1cnc(c1)S(=O)(=O)N1C[C@H]([C@@H](C1)c1ccc(F)cc1)C(=O)Nc1cccc(OC(F)(F)F)c1
InChI Key InChIKey=LIPCQHLIGWAAHR-RBUKOAKNSA-N
Data  1 KI
  Tab Delimited (TSV)   2D SDfile   Computed 3D by Vconf -m prep SDfile
Find this compound or compounds like it in BindingDB:
Activity Spreadsheet -- Enzyme Inhibition Constant Data from BindingDB
Found 1 hit for monomerid = 308759
LigandPNGBDBM308759(Trans-4-(4-fluorophenyl)-1-[(1-methyl-1H-imidazol-...)
Affinity DataKi: <1.00E+3nM. Assay description: Radioligand binding assays using recombinant CHO cell membranes expressing human GlyT1: Radioligand binding to human GlyT1c transporter-expressing me...
Ligand InfoPC cidPC sid
In DepthDetails US Patent