BDBM309606 (R)-5-(3-(4-tert-butylbenzamido)piperidin-1-yl)-3-(4-(morpholine-4-carbonyl)phenylamino)picolinamide ::US9656988, Example 76
SMILES CC(C)(C)OC(=O)N[C@@H]1CCCN(C1)c1cnc(C(N)=O)c(Nc2ccc(cc2)C(=O)N2CCOCC2)c1
InChI Key InChIKey=RIILDYLPOPYJSZ-HXUWFJFHSA-N
Data  1 IC50
  Tab Delimited (TSV)   2D SDfile   Computed 3D by Vconf -m prep SDfile
Find this compound or compounds like it in BindingDB:
Activity Spreadsheet -- Enzyme Inhibition Constant Data from BindingDB
Found 1 hit for monomerid = 309606
TargetTyrosine-protein kinase BTK(Homo sapiens (Human))
Pharmacyclics
US Patent
LigandPNGBDBM309606((R)-5-(3-(4-tert-butylbenzamido)piperidin-1-yl)-3-...)
Affinity DataIC50:  550nM. Assay description: Human Btk kinase (Genbank accession # NP_000052) was purified from insect cells as a full-length construct containing a N-terminal 6×-His tag. Btk ki...
Ligand InfoPC cidPC sid
In DepthDetails US Patent