BDBM13533 1-[2-(4-methylphenyl)-5-tert-butyl-pyrazol-3-yl]-3-[4-(2-morpholin-4-ylethoxy)naphthalen-1-yl]urea::1-[5-tert-butyl-2-(4-methylphenyl)-3-pyrazolyl]-3-[4-[2-(4-morpholinyl)ethoxy]-1-naphthalenyl]urea::1-[5-tert-butyl-2-(4-methylphenyl)pyrazol-3-yl]-3-[4-(2-morpholin-4-ylethoxy)naphthalen-1-yl]urea::1-[5-tert-butyl-2-(p-tolyl)pyrazol-3-yl]-3-[4-(2-morpholinoethoxy)-1-naphthyl]urea::3-[2-(4-methylphenyl)-5-tert-butyl-pyrazol-3-yl]-1-[4-(2-morpholin-4-ylethoxy)naphthalen-1-yl]urea::3-[3-tert-butyl-1-(4-methylphenyl)-1H-pyrazol-5-yl]-1-{4-[2-(morpholin-4-yl)ethoxy]naphthalen-1-yl}urea::BIRB 796::BIRB-796::BIRB-796, 3::CHEMBL103667::D3RKN_73::Doramapimod::US11407771, Compound 43::US8933228, BIRB 796::US9187470, 43 (BIRB-796)::US9242960, BIRB 796::US9260410, BIRB796::cid_156422::diaryl urea compound 10
SMILES Cc1ccc(cc1)-n1nc(cc1NC(=O)Nc1ccc(OCCN2CCOCC2)c2ccccc12)C(C)(C)C
InChI Key InChIKey=MVCOAUNKQVWQHZ-UHFFFAOYSA-N
Data  7 KI  235 IC50  891 Kd  1 EC50  1 Koff  1 Kon
PDB links: 8 PDB IDs match this monomer.
  Tab Delimited (TSV)   2D SDfile   Computed 3D by Vconf -m prep SDfile
Find this compound or compounds like it in BindingDB:
Activity Spreadsheet -- Enzyme Inhibition Constant Data from BindingDB
Found 1136 hits for monomerid = 13533
TargetMitogen-activated protein kinase 14(Homo sapiens (Human))
University Of California San Francisco
Curated by ChEMBL
LigandPNGBDBM13533(1-[2-(4-methylphenyl)-5-tert-butyl-pyrazol-3-yl]-3...)
Affinity DataKi:  0.100nM. Assay description: Inhibition of p38alpha
TargetMitogen-activated protein kinase 14(Homo sapiens (Human))
University Of California San Francisco
Curated by ChEMBL
LigandPNGBDBM13533(1-[2-(4-methylphenyl)-5-tert-butyl-pyrazol-3-yl]-3...)
Affinity DataKi:  6.40nM. Assay description: Displacement of rhodamine-green labeled (2-(6-amino-3-imino-3H-xanthen-9-yl)-5-{[({4-[4-(4-Cl-3-hydroxyphenyl)-5-(4-pyridinyl)-1H-imidazol-2yl]phenyl...
TargetMitogen-activated protein kinase 14(Homo sapiens (Human))
University Of California San Francisco
Curated by ChEMBL
LigandPNGBDBM13533(1-[2-(4-methylphenyl)-5-tert-butyl-pyrazol-3-yl]-3...)
Affinity DataKi:  22nM. Assay description: Binding affinity to full-length GST-tagged p38alpha after 2.5 hrs by TR-FRET competition binding assay
TargetMast/stem cell growth factor receptor Kit(Homo sapiens (Human))
Ambit Biosciences
Curated by PubChem BioAssay
LigandPNGBDBM13533(1-[2-(4-methylphenyl)-5-tert-butyl-pyrazol-3-yl]-3...)
Affinity DataKi:  1.70E+5nM ΔG°:  -5.14kcal/molepH: 7.4 T: 2°C. Assay description: Kinase inhibitors are a new class of therapeutics with a propensity to inhibit multiple targets. The biological consequences of multi-kinase activity...
In DepthDetails PCBioAssay
TargetMast/stem cell growth factor receptor Kit(Homo sapiens (Human))
Ambit Biosciences
Curated by PubChem BioAssay
LigandPNGBDBM13533(1-[2-(4-methylphenyl)-5-tert-butyl-pyrazol-3-yl]-3...)
Affinity DataKi:  2.30E+5nM. Assay description: Kinase inhibitors are a new class of therapeutics with a propensity to inhibit multiple targets. The biological consequences of multi-kinase activity...
In DepthDetails PCBioAssay
TargetMast/stem cell growth factor receptor Kit(Homo sapiens (Human))
Ambit Biosciences
Curated by PubChem BioAssay
LigandPNGBDBM13533(1-[2-(4-methylphenyl)-5-tert-butyl-pyrazol-3-yl]-3...)
Affinity DataKi:  2.60E+5nM ΔG°:  -4.89kcal/molepH: 7.4 T: 2°C. Assay description: Kinase inhibitors are a new class of therapeutics with a propensity to inhibit multiple targets. The biological consequences of multi-kinase activity...
In DepthDetails PCBioAssay
TargetMast/stem cell growth factor receptor Kit(Homo sapiens (Human))
Ambit Biosciences
Curated by PubChem BioAssay
LigandPNGBDBM13533(1-[2-(4-methylphenyl)-5-tert-butyl-pyrazol-3-yl]-3...)
Affinity DataKi:  2.40E+6nM ΔG°:  -3.57kcal/molepH: 7.4 T: 2°C. Assay description: Kinase inhibitors are a new class of therapeutics with a propensity to inhibit multiple targets. The biological consequences of multi-kinase activity...
In DepthDetails PCBioAssay
TargetTyrosine-protein kinase ABL1 [201-500](Homo sapiens (Human))
Ambit
LigandPNGBDBM13533(1-[2-(4-methylphenyl)-5-tert-butyl-pyrazol-3-yl]-3...)
Affinity DataKd:  2.00E+3nM. Assay description: Competition binding assay was used to measure the interaction between the phage-tagged kinase, immobilized competitive ligand, and unlinked test comp...
In DepthDetails ArticlePubMed
TargetTyrosine-protein kinase ABL1 [201-500,Q252H](Homo sapiens (Human))
Ambit
LigandPNGBDBM13533(1-[2-(4-methylphenyl)-5-tert-butyl-pyrazol-3-yl]-3...)
Affinity DataKd:  4.00E+3nM. Assay description: Competition binding assay was used to measure the interaction between the phage-tagged kinase, immobilized competitive ligand, and unlinked test comp...
In DepthDetails ArticlePubMed
TargetTyrosine-protein kinase ABL1 [201-500,Y253F](Homo sapiens (Human))
Ambit
LigandPNGBDBM13533(1-[2-(4-methylphenyl)-5-tert-butyl-pyrazol-3-yl]-3...)
Affinity DataKd:  2.00E+3nM. Assay description: Competition binding assay was used to measure the interaction between the phage-tagged kinase, immobilized competitive ligand, and unlinked test comp...
In DepthDetails ArticlePubMed
TargetTyrosine-protein kinase ABL1 [201-500,E255K](Homo sapiens (Human))
Ambit
LigandPNGBDBM13533(1-[2-(4-methylphenyl)-5-tert-butyl-pyrazol-3-yl]-3...)
Affinity DataKd: >1.00E+4nM. Assay description: Competition binding assay was used to measure the interaction between the phage-tagged kinase, immobilized competitive ligand, and unlinked test comp...
In DepthDetails ArticlePubMed
TargetTyrosine-protein kinase ABL1 [201-500,M351T](Homo sapiens (Human))
Ambit
LigandPNGBDBM13533(1-[2-(4-methylphenyl)-5-tert-butyl-pyrazol-3-yl]-3...)
Affinity DataKd:  2.00E+3nM. Assay description: Competition binding assay was used to measure the interaction between the phage-tagged kinase, immobilized competitive ligand, and unlinked test comp...
In DepthDetails ArticlePubMed
TargetTyrosine-protein kinase ABL1 [201-500,F359V](Homo sapiens (Human))
Ambit
LigandPNGBDBM13533(1-[2-(4-methylphenyl)-5-tert-butyl-pyrazol-3-yl]-3...)
Affinity DataKd:  8.00E+3nM. Assay description: Competition binding assay was used to measure the interaction between the phage-tagged kinase, immobilized competitive ligand, and unlinked test comp...
In DepthDetails ArticlePubMed
TargetTyrosine-protein kinase ABL1 [201-500,H396P](Homo sapiens (Human))
Ambit
LigandPNGBDBM13533(1-[2-(4-methylphenyl)-5-tert-butyl-pyrazol-3-yl]-3...)
Affinity DataKd: >1.00E+4nM. Assay description: Competition binding assay was used to measure the interaction between the phage-tagged kinase, immobilized competitive ligand, and unlinked test comp...
In DepthDetails ArticlePubMed
TargetTyrosine-protein kinase ABL1 [201-500,T315I](Homo sapiens (Human))
Ambit
LigandPNGBDBM13533(1-[2-(4-methylphenyl)-5-tert-butyl-pyrazol-3-yl]-3...)
Affinity DataKd:  40nM. Assay description: Competition binding assay was used to measure the interaction between the phage-tagged kinase, immobilized competitive ligand, and unlinked test comp...
In DepthDetails ArticlePubMed
TargetTyrosine-protein kinase ABL1 [201-500,T315N](Homo sapiens (Human))
Ambit
LigandPNGBDBM13533(1-[2-(4-methylphenyl)-5-tert-butyl-pyrazol-3-yl]-3...)
Affinity DataKd: >1.00E+4nM. Assay description: Competition binding assay was used to measure the interaction between the phage-tagged kinase, immobilized competitive ligand, and unlinked test comp...
In DepthDetails ArticlePubMed
TargetMast/stem cell growth factor receptor Kit [N822K](Homo sapiens (Human))
Ambit
LigandPNGBDBM13533(1-[2-(4-methylphenyl)-5-tert-butyl-pyrazol-3-yl]-3...)
Affinity DataKd:  200nM. Assay description: Competition binding assay was used to measure the interaction between the phage-tagged kinase, immobilized competitive ligand, and unlinked test comp...
In DepthDetails ArticlePubMed
TargetMast/stem cell growth factor receptor Kit [V559D](Homo sapiens (Human))
Ambit
LigandPNGBDBM13533(1-[2-(4-methylphenyl)-5-tert-butyl-pyrazol-3-yl]-3...)
Affinity DataKd:  200nM. Assay description: Competition binding assay was used to measure the interaction between the phage-tagged kinase, immobilized competitive ligand, and unlinked test comp...
In DepthDetails ArticlePubMed
LigandPNGBDBM13533(1-[2-(4-methylphenyl)-5-tert-butyl-pyrazol-3-yl]-3...)
Affinity DataKd:  300nM. Assay description: Competition binding assay was used to measure the interaction between the phage-tagged kinase, immobilized competitive ligand, and unlinked test comp...
In DepthDetails ArticlePubMed
TargetMitogen-activated protein kinase 14(Homo sapiens (Human))
University Of California San Francisco
Curated by ChEMBL
LigandPNGBDBM13533(1-[2-(4-methylphenyl)-5-tert-butyl-pyrazol-3-yl]-3...)
Affinity DataKd:  0.100nMpH: 7.0 T: 2°C. Assay description: The exchange curve assays were run as two half-reactions using an SLM Aminco Bowman Series 2 model SQ-340 fluorescence detector. In the first half re...
TargetMitogen-activated protein kinase 14(Homo sapiens (Human))
University Of California San Francisco
Curated by ChEMBL
LigandPNGBDBM13533(1-[2-(4-methylphenyl)-5-tert-butyl-pyrazol-3-yl]-3...)
Affinity DataKd:  0.100nMpH: 7.0 T: 2°C. Assay description: The exchange curve assays were run as two half-reactions using an SLM Aminco Bowman Series 2 model SQ-340 fluorescence detector. In the first half re...
TargetMitogen-activated protein kinase 14(Mus musculus (mouse))
Boehringer Ingelheim Pharmaceuticals
LigandPNGBDBM13533(1-[2-(4-methylphenyl)-5-tert-butyl-pyrazol-3-yl]-3...)
Affinity DataKd:  0.0460nMpH: 7.0 T: 2°C. Assay description: UV thermal melt experiments were carried out in a quartz cuvette loaded with sample containing enzyme and each test compound using a spectrophotomete...
TargetTyrosine-protein kinase ABL1 [T315I](Homo sapiens (Human))
Ambit Biosciences
Curated by PubChem BioAssay
LigandPNGBDBM13533(1-[2-(4-methylphenyl)-5-tert-butyl-pyrazol-3-yl]-3...)
Affinity DataKd:  42nMpH: 7.4 T: 2°C. Assay description: Kinase inhibitors are a new class of therapeutics with a propensity to inhibit multiple targets. The biological consequences of multi-kinase activity...
In DepthDetails PCBioAssay
TargetEpithelial discoidin domain-containing receptor 1(Homo sapiens (Human))
Ambit Biosciences
Curated by PubChem BioAssay
LigandPNGBDBM13533(1-[2-(4-methylphenyl)-5-tert-butyl-pyrazol-3-yl]-3...)
Affinity DataKd:  1.90nMpH: 7.4 T: 2°C. Assay description: Kinase inhibitors are a new class of therapeutics with a propensity to inhibit multiple targets. The biological consequences of multi-kinase activity...
In DepthDetails PCBioAssay
TargetDiscoidin domain-containing receptor 2 [A642S](Homo sapiens (Human))
Ambit Biosciences
Curated by PubChem BioAssay
LigandPNGBDBM13533(1-[2-(4-methylphenyl)-5-tert-butyl-pyrazol-3-yl]-3...)
Affinity DataKd:  33nMpH: 7.4 T: 2°C. Assay description: Kinase inhibitors are a new class of therapeutics with a propensity to inhibit multiple targets. The biological consequences of multi-kinase activity...
In DepthDetails PCBioAssay
TargetEpidermal growth factor receptor [G719C](Homo sapiens (Human))
Ambit Biosciences
Curated by PubChem BioAssay
LigandPNGBDBM13533(1-[2-(4-methylphenyl)-5-tert-butyl-pyrazol-3-yl]-3...)
Affinity DataKd:  6.00E+3nMpH: 7.4 T: 2°C. Assay description: Kinase inhibitors are a new class of therapeutics with a propensity to inhibit multiple targets. The biological consequences of multi-kinase activity...
In DepthDetails PCBioAssay
TargetEphrin type-A receptor 3 [1-975](Homo sapiens (Human))
Ambit Biosciences
Curated by PubChem BioAssay
LigandPNGBDBM13533(1-[2-(4-methylphenyl)-5-tert-butyl-pyrazol-3-yl]-3...)
Affinity DataKd:  880nMpH: 7.4 T: 2°C. Assay description: Kinase inhibitors are a new class of therapeutics with a propensity to inhibit multiple targets. The biological consequences of multi-kinase activity...
TargetMacrophage colony-stimulating factor 1 receptor(Homo sapiens (Human))
Ambit Biosciences
Curated by PubChem BioAssay
LigandPNGBDBM13533(1-[2-(4-methylphenyl)-5-tert-butyl-pyrazol-3-yl]-3...)
Affinity DataKd:  8.10E+3nMpH: 7.4 T: 2°C. Assay description: Kinase inhibitors are a new class of therapeutics with a propensity to inhibit multiple targets. The biological consequences of multi-kinase activity...
In DepthDetails PCBioAssay
TargetCyclin-dependent kinase 19(Homo sapiens (Human))
Ambit Biosciences
Curated by PubChem BioAssay
LigandPNGBDBM13533(1-[2-(4-methylphenyl)-5-tert-butyl-pyrazol-3-yl]-3...)
Affinity DataKd:  200nMpH: 7.4 T: 2°C. Assay description: Kinase inhibitors are a new class of therapeutics with a propensity to inhibit multiple targets. The biological consequences of multi-kinase activity...
In DepthDetails PCBioAssay
TargetCyclin-dependent kinase 8(Homo sapiens (Human))
Ambit Biosciences
Curated by PubChem BioAssay
LigandPNGBDBM13533(1-[2-(4-methylphenyl)-5-tert-butyl-pyrazol-3-yl]-3...)
Affinity DataKd:  220nMpH: 7.4 T: 2°C. Assay description: Kinase inhibitors are a new class of therapeutics with a propensity to inhibit multiple targets. The biological consequences of multi-kinase activity...
In DepthDetails PCBioAssay
TargetEphrin type-A receptor 7(Homo sapiens (Human))
Ambit Biosciences
Curated by PubChem BioAssay
LigandPNGBDBM13533(1-[2-(4-methylphenyl)-5-tert-butyl-pyrazol-3-yl]-3...)
Affinity DataKd:  2.00E+3nMpH: 7.4 T: 2°C. Assay description: Kinase inhibitors are a new class of therapeutics with a propensity to inhibit multiple targets. The biological consequences of multi-kinase activity...
In DepthDetails PCBioAssay
TargetEphrin type-A receptor 7(Homo sapiens (Human))
Ambit Biosciences
Curated by PubChem BioAssay
LigandPNGBDBM13533(1-[2-(4-methylphenyl)-5-tert-butyl-pyrazol-3-yl]-3...)
Affinity DataKd:  860nMpH: 7.4 T: 2°C. Assay description: Kinase inhibitors are a new class of therapeutics with a propensity to inhibit multiple targets. The biological consequences of multi-kinase activity...
In DepthDetails PCBioAssay
TargetMitogen-activated protein kinase 15(Homo sapiens (Human))
Ambit Biosciences
Curated by PubChem BioAssay
LigandPNGBDBM13533(1-[2-(4-methylphenyl)-5-tert-butyl-pyrazol-3-yl]-3...)
Affinity DataKd:  3.00E+3nMpH: 7.4 T: 2°C. Assay description: Kinase inhibitors are a new class of therapeutics with a propensity to inhibit multiple targets. The biological consequences of multi-kinase activity...
In DepthDetails PCBioAssay
TargetReceptor-type tyrosine-protein kinase FLT3 [N841I](Homo sapiens (Human))
Ambit Biosciences
Curated by PubChem BioAssay
LigandPNGBDBM13533(1-[2-(4-methylphenyl)-5-tert-butyl-pyrazol-3-yl]-3...)
Affinity DataKd:  5.00E+3nMpH: 7.4 T: 2°C. Assay description: Kinase inhibitors are a new class of therapeutics with a propensity to inhibit multiple targets. The biological consequences of multi-kinase activity...
In DepthDetails PCBioAssay
TargetVascular endothelial growth factor receptor 3(Homo sapiens (Human))
Ambit Biosciences
Curated by PubChem BioAssay
LigandPNGBDBM13533(1-[2-(4-methylphenyl)-5-tert-butyl-pyrazol-3-yl]-3...)
Affinity DataKd:  7.10E+3nMpH: 7.4 T: 2°C. Assay description: Kinase inhibitors are a new class of therapeutics with a propensity to inhibit multiple targets. The biological consequences of multi-kinase activity...
In DepthDetails PCBioAssay
TargetTyrosine-protein kinase FRK(Homo sapiens (Human))
Ambit Biosciences
Curated by PubChem BioAssay
LigandPNGBDBM13533(1-[2-(4-methylphenyl)-5-tert-butyl-pyrazol-3-yl]-3...)
Affinity DataKd:  1.20E+3nMpH: 7.4 T: 2°C. Assay description: Kinase inhibitors are a new class of therapeutics with a propensity to inhibit multiple targets. The biological consequences of multi-kinase activity...
In DepthDetails PCBioAssay
TargetMitogen-activated protein kinase 9(Homo sapiens (Human))
Ambit Biosciences
Curated by PubChem BioAssay
LigandPNGBDBM13533(1-[2-(4-methylphenyl)-5-tert-butyl-pyrazol-3-yl]-3...)
Affinity DataKd:  7.30nMpH: 7.4 T: 2°C. Assay description: Kinase inhibitors are a new class of therapeutics with a propensity to inhibit multiple targets. The biological consequences of multi-kinase activity...
TargetReceptor-type tyrosine-protein kinase FLT3(Homo sapiens (Human))
Ambit Biosciences
Curated by PubChem BioAssay
LigandPNGBDBM13533(1-[2-(4-methylphenyl)-5-tert-butyl-pyrazol-3-yl]-3...)
Affinity DataKd:  2.30E+3nMpH: 7.4 T: 2°C. Assay description: Kinase inhibitors are a new class of therapeutics with a propensity to inhibit multiple targets. The biological consequences of multi-kinase activity...
In DepthDetails PCBioAssay
TargetTyrosine-protein kinase Lck(Homo sapiens (Human))
Ambit Biosciences
Curated by PubChem BioAssay
LigandPNGBDBM13533(1-[2-(4-methylphenyl)-5-tert-butyl-pyrazol-3-yl]-3...)
Affinity DataKd:  1.20E+3nM. Assay description: Kinase inhibitors are a new class of therapeutics with a propensity to inhibit multiple targets. The biological consequences of multi-kinase activity...
In DepthDetails PCBioAssay
TargetTyrosine-protein kinase Lyn(Homo sapiens (Human))
Ambit Biosciences
Curated by PubChem BioAssay
LigandPNGBDBM13533(1-[2-(4-methylphenyl)-5-tert-butyl-pyrazol-3-yl]-3...)
Affinity DataKd:  2.70E+3nM. Assay description: Kinase inhibitors are a new class of therapeutics with a propensity to inhibit multiple targets. The biological consequences of multi-kinase activity...
In DepthDetails PCBioAssay
TargetMitogen-activated protein kinase kinase kinase 20(Homo sapiens (Human))
Ambit Biosciences
Curated by PubChem BioAssay
LigandPNGBDBM13533(1-[2-(4-methylphenyl)-5-tert-butyl-pyrazol-3-yl]-3...)
Affinity DataKd:  860nM. Assay description: Kinase inhibitors are a new class of therapeutics with a propensity to inhibit multiple targets. The biological consequences of multi-kinase activity...
In DepthDetails PCBioAssay
TargetTyrosine-protein kinase ABL1(Homo sapiens (Human))
Ambit Biosciences
Curated by PubChem BioAssay
LigandPNGBDBM13533(1-[2-(4-methylphenyl)-5-tert-butyl-pyrazol-3-yl]-3...)
Affinity DataKd:  3.70E+3nM. Assay description: Kinase inhibitors are a new class of therapeutics with a propensity to inhibit multiple targets. The biological consequences of multi-kinase activity...
In DepthDetails PCBioAssay
TargetTyrosine-protein kinase ABL1 [1-999,Q252H](Homo sapiens (Human))
Ambit Biosciences
Curated by PubChem BioAssay
LigandPNGBDBM13533(1-[2-(4-methylphenyl)-5-tert-butyl-pyrazol-3-yl]-3...)
Affinity DataKd:  6.90E+6nM. Assay description: Kinase inhibitors are a new class of therapeutics with a propensity to inhibit multiple targets. The biological consequences of multi-kinase activity...
In DepthDetails PCBioAssay
TargetTyrosine-protein kinase ABL1(Homo sapiens (Human))
Ambit Biosciences
Curated by PubChem BioAssay
LigandPNGBDBM13533(1-[2-(4-methylphenyl)-5-tert-butyl-pyrazol-3-yl]-3...)
Affinity DataKd:  5.70E+3nM. Assay description: Kinase inhibitors are a new class of therapeutics with a propensity to inhibit multiple targets. The biological consequences of multi-kinase activity...
In DepthDetails PCBioAssay
TargetAnkyrin repeat and protein kinase domain-containing protein 1(Homo sapiens (Human))
Ambit Biosciences
Curated by PubChem BioAssay
LigandPNGBDBM13533(1-[2-(4-methylphenyl)-5-tert-butyl-pyrazol-3-yl]-3...)
Affinity DataKd:  1.00E+3nM. Assay description: Kinase inhibitors are a new class of therapeutics with a propensity to inhibit multiple targets. The biological consequences of multi-kinase activity...
In DepthDetails PCBioAssay
TargetCyclin-dependent kinase 5(Homo sapiens (Human))
Ambit Biosciences
Curated by PubChem BioAssay
LigandPNGBDBM13533(1-[2-(4-methylphenyl)-5-tert-butyl-pyrazol-3-yl]-3...)
Affinity DataKd:  2.00E+3nM. Assay description: Kinase inhibitors are a new class of therapeutics with a propensity to inhibit multiple targets. The biological consequences of multi-kinase activity...
In DepthDetails PCBioAssay
TargetEphrin type-A receptor 2(Homo sapiens (Human))
Ambit Biosciences
Curated by PubChem BioAssay
LigandPNGBDBM13533(1-[2-(4-methylphenyl)-5-tert-butyl-pyrazol-3-yl]-3...)
Affinity DataKd:  6.20E+3nM. Assay description: Kinase inhibitors are a new class of therapeutics with a propensity to inhibit multiple targets. The biological consequences of multi-kinase activity...
In DepthDetails PCBioAssay
TargetEphrin type-A receptor 4(Homo sapiens (Human))
Ambit Biosciences
Curated by PubChem BioAssay
LigandPNGBDBM13533(1-[2-(4-methylphenyl)-5-tert-butyl-pyrazol-3-yl]-3...)
Affinity DataKd:  2.90E+3nM. Assay description: Kinase inhibitors are a new class of therapeutics with a propensity to inhibit multiple targets. The biological consequences of multi-kinase activity...
In DepthDetails PCBioAssay
TargetEphrin type-A receptor 5(Homo sapiens (Human))
Ambit Biosciences
Curated by PubChem BioAssay
LigandPNGBDBM13533(1-[2-(4-methylphenyl)-5-tert-butyl-pyrazol-3-yl]-3...)
Affinity DataKd:  1.40E+3nM. Assay description: Kinase inhibitors are a new class of therapeutics with a propensity to inhibit multiple targets. The biological consequences of multi-kinase activity...
In DepthDetails PCBioAssay
TargetEphrin type-A receptor 8(Homo sapiens (Human))
Ambit Biosciences
Curated by PubChem BioAssay
LigandPNGBDBM13533(1-[2-(4-methylphenyl)-5-tert-butyl-pyrazol-3-yl]-3...)
Affinity DataKd:  270nM. Assay description: Kinase inhibitors are a new class of therapeutics with a propensity to inhibit multiple targets. The biological consequences of multi-kinase activity...
In DepthDetails PCBioAssay
Displayed 1 to 50 (of 1136 total ) | Next | Last >>