BDBM31113 5-hydroxy-1H-indole-3-carboxylate, 10a
SMILES CCOC(=O)c1c(Cc2cccc(Cl)c2)[nH]c2ccc(O)cc12
InChI Key InChIKey=RGZXXPDUSCBZHM-UHFFFAOYSA-N
Data  1 IC50  1 EC50
  Tab Delimited (TSV)   2D SDfile   Computed 3D by Vconf -m prep SDfile
Find this compound or compounds like it in BindingDB:
Activity Spreadsheet -- Enzyme Inhibition Constant Data from BindingDB
Found 1 hit for monomerid = 31113
TargetPolyunsaturated fatty acid 5-lipoxygenase(Homo sapiens (Human))
Friedrich Alexander University Erlangen
LigandPNGBDBM31113(5-hydroxy-1H-indole-3-carboxylate, 10a)
Affinity DataIC50:  2.00E+3nM EC50:  1.70E+3nMpH: 7.4 T: 2°C. Assay description: For determination of the activity of 5-LO in 40000g supernatant (S40), aliquots of the supernatants were added to reaction mix, and were preincubated...
In DepthDetails ArticlePubMed