BDBM311206 (S)-1-(2-(difluoromethyl)-4-(2-methylpyridin-4-yl)phenoxy)-2,4-dimethylpentan-2-amine::US10155760, Example 50::US10351563, Example 50::US10544120, Example 50::US10723734, Example 50::US10981910, Example 50::US9902722, Example 50
SMILES CC(C)C[C@](C)(N)COc1ccc(cc1C(F)F)-c1ccnc(C)c1
InChI Key InChIKey=LLASSJMOZUBNPF-FQEVSTJZSA-N
Data  9 IC50
  Tab Delimited (TSV)   2D SDfile   Computed 3D by Vconf -m prep SDfile
Find this compound or compounds like it in BindingDB:
Activity Spreadsheet -- Enzyme Inhibition Constant Data from BindingDB
Found 9 hits for monomerid = 311206
TargetAP2-associated protein kinase 1(Homo sapiens (Human))
Bristol-Myers Squibb
US Patent
LigandPNGBDBM311206((S)-1-(2-(difluoromethyl)-4-(2-methylpyridin-4-yl)...)
Affinity DataIC50:  0.380nM. Assay description: The assays were performed in U-bottom 384-well plates. The final assay volume was 30 μl prepared from 15 μl additions of enzyme and substra...
Ligand InfoPC cidPC sid
In DepthDetails US Patent
TargetAP2-associated protein kinase 1(Homo sapiens (Human))
Bristol-Myers Squibb
US Patent
LigandPNGBDBM311206((S)-1-(2-(difluoromethyl)-4-(2-methylpyridin-4-yl)...)
Affinity DataIC50:  0.380nM. Assay description: The assays were performed in U-bottom 384-well plates. The final assay volume was 30 μl prepared from 15 μl additions of enzyme and substra...
Ligand InfoPC cidPC sid
In DepthDetails US Patent
TargetAP2-associated protein kinase 1(Homo sapiens (Human))
Bristol-Myers Squibb
US Patent
LigandPNGBDBM311206((S)-1-(2-(difluoromethyl)-4-(2-methylpyridin-4-yl)...)
Affinity DataIC50:  0.380nM. Assay description: The assays were performed in U-bottom 384-well plates. The final assay volume was 30 μl prepared from 15 μl additions of enzyme and substra...
Ligand InfoPC cidPC sid
In DepthDetails US Patent
TargetAP2-associated protein kinase 1(Homo sapiens (Human))
Bristol-Myers Squibb
US Patent
LigandPNGBDBM311206((S)-1-(2-(difluoromethyl)-4-(2-methylpyridin-4-yl)...)
Affinity DataIC50:  0.380nM. Assay description: The assays were performed in U-bottom 384-well plates. The final assay volume was 30 μl prepared from 15 μl additions of enzyme and substra...
Ligand InfoPC cidPC sid
In DepthDetails US Patent
TargetCytochrome P450 3A4(Homo sapiens (Human))
Bristol-Myers Squibb
Curated by ChEMBL
LigandPNGBDBM311206((S)-1-(2-(difluoromethyl)-4-(2-methylpyridin-4-yl)...)
Affinity DataIC50: >2.00E+4nM. Assay description: Inhibition of CYP3A4 (unknown origin) using BFC as substrate
Ligand InfoPC cidPC sid
In DepthDetails ArticlePubMed
TargetAP2-associated protein kinase 1(Homo sapiens (Human))
Bristol-Myers Squibb
US Patent
LigandPNGBDBM311206((S)-1-(2-(difluoromethyl)-4-(2-methylpyridin-4-yl)...)
Affinity DataIC50:  0.380nM. Assay description: The assays were performed in U-bottom 384-well plates. The final assay volume was 30 μl prepared from 15 μl additions of enzyme and substra...
Ligand InfoPC cidPC sid
In DepthDetails US Patent
TargetAP2-associated protein kinase 1(Homo sapiens (Human))
Bristol-Myers Squibb
US Patent
LigandPNGBDBM311206((S)-1-(2-(difluoromethyl)-4-(2-methylpyridin-4-yl)...)
Affinity DataIC50:  0.400nM. Assay description: Inhibition of GST-Xa tagged human AAK1 (30 to 330 residues) expresssed in bacteria using (5-FAM)-Aha-KEEQSQITSQVTGQIGWR-NH2 peptide as substrate incu...
Ligand InfoPC cidPC sid
In DepthDetails ArticlePubMed
TargetAP2-associated protein kinase 1(Homo sapiens (Human))
Bristol-Myers Squibb
US Patent
LigandPNGBDBM311206((S)-1-(2-(difluoromethyl)-4-(2-methylpyridin-4-yl)...)
Affinity DataIC50:  0.800nM. Assay description: Inhibition of AKK1 in HEK293F cells assessed as reduction in phospho mu2 formation incubated for 3 hrs by Western blot analysis
Ligand InfoPC cidPC sid
In DepthDetails ArticlePubMed
TargetAP2-associated protein kinase 1(Homo sapiens (Human))
Bristol-Myers Squibb
US Patent
LigandPNGBDBM311206((S)-1-(2-(difluoromethyl)-4-(2-methylpyridin-4-yl)...)
Affinity DataIC50:  0.380nM. Assay description: The assays were performed in U-bottom 384-well plates. The final assay volume was 30 Cl prepared from 15 μl additions of enzyme and substrates (...
Ligand InfoPC cidPC sid
In DepthDetails US Patent