BDBM31165 naphthyridinone analog.,19
SMILES Oc1cc2cnccc2[nH]c1=O
InChI Key InChIKey=IOIXDXPZPWZYMM-UHFFFAOYSA-N
Data  3 IC50
  Tab Delimited (TSV)   2D SDfile   Computed 3D by Vconf -m prep SDfile
Find this compound or compounds like it in BindingDB:
Activity Spreadsheet -- Enzyme Inhibition Constant Data from BindingDB
Found 3 hits for monomerid = 31165
TargetD-amino-acid oxidase(Homo sapiens (Human))
Pfizer
LigandPNGBDBM31165(naphthyridinone analog.,19)
Affinity DataIC50:  32nMpH: 8.5 T: 2°C. Assay description: Inhibitory effect of compounds was determined in a cell free fluorescence assay. The H2O2 generated from the degradation of D-serine was linked to ox...
In DepthDetails ArticlePubMed
TargetD-amino-acid oxidase(Rattus norvegicus (rat))
Pfizer
LigandPNGBDBM31165(naphthyridinone analog.,19)
Affinity DataIC50:  3.08E+3nM. Assay description: Inhibitory effect of compounds was determined in a cell free fluorescence assay. The H2O2 generated from the degradation of D-serine was linked to ox...
In DepthDetails ArticlePubMed
TargetD-aspartate oxidase(Homo sapiens (Human))
Pfizer
LigandPNGBDBM31165(naphthyridinone analog.,19)
Affinity DataIC50: >3.60E+4nM. Assay description: Inhibitory effect of compounds was determined in a cell free fluorescence assay. The H2O2 generated from the degradation of D-aspartic acid was linke...
In DepthDetails ArticlePubMed