BDBM312161 US9604926, Compound CM-165::US9724435, Compound CM-165
SMILES Clc1ccc(cc1)C1=CCN(CCCCn2c3ccccc3oc2=O)CC1
InChI Key InChIKey=PBVJQSODSXQLEY-UHFFFAOYSA-N
Data  4 KI
  Tab Delimited (TSV)   2D SDfile   Computed 3D by Vconf -m prep SDfile
Find this compound or compounds like it in BindingDB:
Activity Spreadsheet -- Enzyme Inhibition Constant Data from BindingDB
Found 4 hits for monomerid = 312161
TargetSigma non-opioid intracellular receptor 1(Mus musculus (Mouse))
The University Of Mississippi
US Patent
LigandPNGBDBM312161(US9604926, Compound CM-165 | US9724435, Compound C...)
Affinity DataKi:  2.40nM. Assay description: Compounds were evaluated for σ-1 and σ-2 binding in rat brain homogenates. Twelve concentrations of each test ligand (0.001-1,000 nM) were ...
Ligand InfoPC cidPC sid
In DepthDetails US Patent
TargetSigma non-opioid intracellular receptor 1(RAT)
The University Of Mississippi
US Patent
LigandPNGBDBM312161(US9604926, Compound CM-165 | US9724435, Compound C...)
Affinity DataKi:  2.40nM. Assay description: Compounds were evaluated for σ-1 and σ-2 binding in rat brain homogenates. Twelve concentrations of each test ligand (0.001-1,000 nM) were ...
Ligand InfoPC cidPC sid
In DepthDetails US Patent
TargetSigma intracellular receptor 2(Mus musculus (Mouse))
The University Of Mississippi
US Patent
LigandPNGBDBM312161(US9604926, Compound CM-165 | US9724435, Compound C...)
Affinity DataKi:  14.4nM. Assay description: Compounds were evaluated for σ-1 and σ-2 binding in rat brain homogenates. Twelve concentrations of each test ligand (0.001-1,000 nM) were ...
Ligand InfoPC cidPC sid
In DepthDetails US Patent
TargetSigma intracellular receptor 2(Rattus norvegicus (Rat))
The University Of Mississippi
US Patent
LigandPNGBDBM312161(US9604926, Compound CM-165 | US9724435, Compound C...)
Affinity DataKi:  14.4nM. Assay description: Compounds were evaluated for σ-1 and σ-2 binding in rat brain homogenates. Twelve concentrations of each test ligand (0.001-1,000 nM) were ...
Ligand InfoPC cidPC sid
In DepthDetails US Patent