BDBM312201 US9604926, Compound CM-396::US9724435, Compound CM-396
SMILES Cn1c2ccccc2n(CCCCN2CCN(CC2)C2CCCCC2)c1=O
InChI Key InChIKey=WSCMDSDVNPOTBT-UHFFFAOYSA-N
Data  6 KI
  Tab Delimited (TSV)   2D SDfile   Computed 3D by Vconf -m prep SDfile
Find this compound or compounds like it in BindingDB:
Activity Spreadsheet -- Enzyme Inhibition Constant Data from BindingDB
Found 6 hits for monomerid = 312201
TargetSigma intracellular receptor 2(Rattus norvegicus (Rat))
The University Of Mississippi
US Patent
LigandPNGBDBM312201(US9604926, Compound CM-396 | US9724435, Compound C...)
Affinity DataKi:  2.57nM. Assay description: Compounds were evaluated for σ-1 and σ-2 binding in rat brain homogenates. Twelve concentrations of each test ligand (0.001-1,000 nM) were ...
Ligand InfoPC cidPC sid
In DepthDetails US Patent
TargetSigma intracellular receptor 2(Mus musculus (Mouse))
The University Of Mississippi
US Patent
LigandPNGBDBM312201(US9604926, Compound CM-396 | US9724435, Compound C...)
Affinity DataKi:  2.57nM. Assay description: Compounds were evaluated for σ-1 and σ-2 binding in rat brain homogenates. Twelve concentrations of each test ligand (0.001-1,000 nM) were ...
Ligand InfoPC cidPC sid
In DepthDetails US Patent
TargetSigma intracellular receptor 2(Rattus norvegicus (Rat))
The University Of Mississippi
US Patent
LigandPNGBDBM312201(US9604926, Compound CM-396 | US9724435, Compound C...)
Affinity DataKi:  2.60nM. Assay description: Displacement of [3H]-DTG from sigma2 receptor in rat brain membranes after 120 mins in presence of (+)-pentazocine by radioligand binding assay
Ligand InfoPC cidPC sid
In DepthDetails ArticlePubMed
TargetSigma non-opioid intracellular receptor 1(RAT)
University Of Florida
Curated by ChEMBL
LigandPNGBDBM312201(US9604926, Compound CM-396 | US9724435, Compound C...)
Affinity DataKi:  50nM. Assay description: Displacement of [3H](+)-pentazocine from sigma1 receptor in rat brain membranes after 120 mins by radioligand binding assay
Ligand InfoPC cidPC sid
In DepthDetails ArticlePubMed
TargetSigma non-opioid intracellular receptor 1(RAT)
University Of Florida
Curated by ChEMBL
LigandPNGBDBM312201(US9604926, Compound CM-396 | US9724435, Compound C...)
Affinity DataKi:  50.2nM. Assay description: Compounds were evaluated for σ-1 and σ-2 binding in rat brain homogenates. Twelve concentrations of each test ligand (0.001-1,000 nM) were ...
Ligand InfoPC cidPC sid
In DepthDetails US Patent
TargetSigma non-opioid intracellular receptor 1(Mus musculus (Mouse))
The University Of Mississippi
US Patent
LigandPNGBDBM312201(US9604926, Compound CM-396 | US9724435, Compound C...)
Affinity DataKi:  50.2nM. Assay description: Compounds were evaluated for σ-1 and σ-2 binding in rat brain homogenates. Twelve concentrations of each test ligand (0.001-1,000 nM) were ...
Ligand InfoPC cidPC sid
In DepthDetails US Patent