BDBM312402 2-[6,6-Difluoro-3-(3-trifluoromethyl-[1,2,4]oxadiazol-5-yl)-4,5,6,7-tetrahydro-benzo[b]-thiophen-2-ylcarbamoyl]-cyclohex-1-enecarboxylic acid::US9604977, Example 148::US9604977, Example 149
SMILES OC(=O)C1=C(CCCC1)C(=O)Nc1sc2CC(F)(F)CCc2c1-c1nc(no1)C(F)(F)F
InChI Key InChIKey=AEJMCKQMGAQIDR-UHFFFAOYSA-N
Data  4 IC50
  Tab Delimited (TSV)   2D SDfile   Computed 3D by Vconf -m prep SDfile
Find this compound or compounds like it in BindingDB:
Activity Spreadsheet -- Enzyme Inhibition Constant Data from BindingDB
Found 4 hits for monomerid = 312402
TargetFatty acid-binding protein, adipocyte(Homo sapiens (Human))
Hoffmann-La Roche
US Patent
LigandPNGBDBM312402(2-[6,6-Difluoro-3-(3-trifluoromethyl-[1,2,4]oxadia...)
Affinity DataIC50:  8.49E+3nM. Assay description: Compounds were profiled for activity against human FABP4 (huFABP4) and/or human FABP5 (huFABP5) in Terbium (Tb) time resolved-fluorescence energy tra...
Ligand InfoPC cidPC sid
In DepthDetails US Patent
TargetFatty acid-binding protein 5(Homo sapiens (Human))
Hoffmann-La Roche
US Patent
LigandPNGBDBM312402(2-[6,6-Difluoro-3-(3-trifluoromethyl-[1,2,4]oxadia...)
Affinity DataIC50:  50nM. Assay description: Compounds were profiled for activity against human FABP4 (huFABP4) and/or human FABP5 (huFABP5) in Terbium (Tb) time resolved-fluorescence energy tra...
Ligand InfoPC cidPC sid
In DepthDetails US Patent
TargetFatty acid-binding protein, adipocyte(Homo sapiens (Human))
Hoffmann-La Roche
US Patent
LigandPNGBDBM312402(2-[6,6-Difluoro-3-(3-trifluoromethyl-[1,2,4]oxadia...)
Affinity DataIC50:  40nM. Assay description: Compounds were profiled for activity against human FABP4 (huFABP4) and/or human FABP5 (huFABP5) in Terbium (Tb) time resolved-fluorescence energy tra...
Ligand InfoPC cidPC sid
In DepthDetails US Patent
TargetFatty acid-binding protein 5(Homo sapiens (Human))
Hoffmann-La Roche
US Patent
LigandPNGBDBM312402(2-[6,6-Difluoro-3-(3-trifluoromethyl-[1,2,4]oxadia...)
Affinity DataIC50:  1.27E+4nM. Assay description: Compounds were profiled for activity against human FABP4 (huFABP4) and/or human FABP5 (huFABP5) in Terbium (Tb) time resolved-fluorescence energy tra...
Ligand InfoPC cidPC sid
In DepthDetails US Patent