BDBM31323 1,4-benzodiazepine-2,5-dione antagonist, 8::Racemic mixture of (S, S) and (R, R) isomers.
SMILES CN1c2ccc(I)cc2C(=O)N([C@H](C(O)=O)c2ccc(Cl)cc2)[C@@H](c2ccc(Cl)cc2)C1=O
InChI Key InChIKey=NFQDVKDBCGSJQN-SFTDATJTSA-N
Data  1 IC50
  Tab Delimited (TSV)   2D SDfile   Computed 3D by Vconf -m prep SDfile
Find this compound or compounds like it in BindingDB:
Activity Spreadsheet -- Enzyme Inhibition Constant Data from BindingDB
Found 1 hit for monomerid = 31323
TargetE3 ubiquitin-protein ligase Mdm2(Homo sapiens (Human))
Johnson & Johnson Pharmaceutical
LigandPNGBDBM31323(1,4-benzodiazepine-2,5-dione antagonist, 8 | Racem...)
Affinity DataIC50:  2.18E+3nMpH: 7.5 T: 2°C. Assay description: Test compound was incubated for 15 minutes with 30 nM peptide fluorescein-FMDYWEGLN (Fl 9mer) and 120 nM (glycine-HDM2 17-125) in assay buffer. The p...
In DepthDetails ArticlePubMed