BDBM313355 US10166249, Example 591::US10166249, Example 592
SMILES CCCCOCCOC1CCc2cc(ccc2C1)[C@@H]1CC[C@](N)(COP(O)(O)=O)C1
InChI Key InChIKey=HKJDXQXUCTXLCM-NHXNGRAPSA-N
Data  2 IC50  6 EC50
  Tab Delimited (TSV)   2D SDfile   Computed 3D by Vconf -m prep SDfile
Find this compound or compounds like it in BindingDB:
Activity Spreadsheet -- Enzyme Inhibition Constant Data from BindingDB
Found 8 hits for monomerid = 313355
TargetSphingosine-1-phosphate lyase 1(Homo sapiens (Human))
Bristol-Myers Squibb
US Patent
LigandPNGBDBM313355(US10166249, Example 591 | US10166249, Example 592)
Affinity DataIC50:  55nM. Assay description: Membranes were prepared from CHO cells expressing human S1P1. Cells pellets (1×109 cells/pellet) were suspended in buffer containing 20 mM HEPES (4-(...
Ligand InfoPC cidPC sid
In DepthDetails US Patent
TargetSphingosine-1-phosphate lyase 1(Homo sapiens (Human))
Bristol-Myers Squibb
US Patent
LigandPNGBDBM313355(US10166249, Example 591 | US10166249, Example 592)
Affinity DataEC50:  55nM. Assay description: Compounds were loaded in a 384 Falcon v-bottom plate (0.5 l/well in a 11 point, 3-fold dilution). Membranes prepared from S1P1/CHO cells or EDG3-Gal5...
Ligand InfoPC cidPC sid
In DepthDetails US Patent
TargetSphingosine-1-phosphate lyase 1(Homo sapiens (Human))
Bristol-Myers Squibb
US Patent
LigandPNGBDBM313355(US10166249, Example 591 | US10166249, Example 592)
Affinity DataEC50: <10nM. Assay description: hS1P1/CHO cells were plated into BD Amine 384-well plates the day before the assay. On the day of the assay, growth medium was removed and replaced w...
Ligand InfoPC cidPC sid
In DepthDetails US Patent
TargetSphingosine 1-phosphate receptor 3(Homo sapiens (Human))
Bristol-Myers Squibb
US Patent
LigandPNGBDBM313355(US10166249, Example 591 | US10166249, Example 592)
Affinity DataEC50: >625nM. Assay description: Compounds were loaded in a 384 Falcon v-bottom plate (0.5 l/well in a 11 point, 3-fold dilution). Membranes prepared from S1P1/CHO cells or EDG3-Gal5...
Ligand InfoPC cidPC sid
In DepthDetails US Patent
TargetSphingosine-1-phosphate lyase 1(Homo sapiens (Human))
Bristol-Myers Squibb
US Patent
LigandPNGBDBM313355(US10166249, Example 591 | US10166249, Example 592)
Affinity DataIC50: <10nM. Assay description: Membranes were prepared from CHO cells expressing human S1P1. Cells pellets (1×109 cells/pellet) were suspended in buffer containing 20 mM HEPES (4-(...
Ligand InfoPC cidPC sid
In DepthDetails US Patent
TargetSphingosine-1-phosphate lyase 1(Homo sapiens (Human))
Bristol-Myers Squibb
US Patent
LigandPNGBDBM313355(US10166249, Example 591 | US10166249, Example 592)
Affinity DataEC50:  55nM. Assay description: Compounds were loaded in a 384 Falcon v-bottom plate (0.5 l/well in a 11 point, 3-fold dilution). Membranes prepared from S1P1/CHO cells or EDG3-Gal5...
Ligand InfoPC cidPC sid
In DepthDetails US Patent
TargetSphingosine-1-phosphate lyase 1(Homo sapiens (Human))
Bristol-Myers Squibb
US Patent
LigandPNGBDBM313355(US10166249, Example 591 | US10166249, Example 592)
Affinity DataEC50: <10nM. Assay description: hS1P1/CHO cells were plated into BD Amine 384-well plates the day before the assay. On the day of the assay, growth medium was removed and replaced w...
Ligand InfoPC cidPC sid
In DepthDetails US Patent
TargetSphingosine 1-phosphate receptor 3(Homo sapiens (Human))
Bristol-Myers Squibb
US Patent
LigandPNGBDBM313355(US10166249, Example 591 | US10166249, Example 592)
Affinity DataEC50: >625nM. Assay description: Compounds were loaded in a 384 Falcon v-bottom plate (0.5 l/well in a 11 point, 3-fold dilution). Membranes prepared from S1P1/CHO cells or EDG3-Gal5...
Ligand InfoPC cidPC sid
In DepthDetails US Patent